program: Gaussian 09
title: 000275955
version: EM64L-G09RevD.01
frameworkgroup: C1[X(C22H20O7)]
method: RPBEPBE
basis: SDD
operation: Freq
keyword: #pfreq=noraman
keyword: PBEPBE/SDD
title: #p freq=noraman PBEPBE/SDD
converged: YES YES NO NO
title: Mulliken charges:
elementType: O O O O O O O C C C C C C C C C C C C C C C C C C C C C C H H H H H H H H H H H H H H H H H H H H
charge: -0.216245 -0.249234 -0.255509 -0.205844 -0.309418 -0.292710 -0.304592 -0.234136 -0.674320 -0.018684 0.421066 0.214705 0.069261 -0.348450 0.113907 0.043115 0.449954 -0.467538 0.148354 -0.360911 -0.549842 -0.574549 -0.208830 0.280743 0.253883 0.006966 -0.527811 -0.526358 -0.524643 0.278935 0.238761 0.231661 0.229639 0.223603 0.245627 0.255580 0.275991 0.266350 0.239363 0.244342 0.223531 0.253297 0.225769 0.253592 0.228241 0.225353 0.231583 0.249651 0.226802
chargesum: 0.00000
title: Mulliken charges with hydrogens summed into heavy atoms:
elementType: O O O O O O O C C C C C C C C C C C C C C C C C C C C C C
charge: -0.216245 -0.249234 -0.255509 -0.205844 -0.309418 -0.292710 -0.304592 0.044800 -0.203899 -0.018684 0.421066 0.214705 0.069261 0.104792 0.113907 0.043115 0.449954 -0.221911 0.148354 -0.105331 -0.273851 -0.308199 0.274875 0.280743 0.253883 0.006966 0.174786 0.180828 0.183393
polarizability: 3.49019602e+02 -1.50467621e+01 3.05828034e+02 -2.07848771e+01 -4.89992748e+00 1.81814411e+02
1716.lowfreq: -5.3591 -2.4802 -0.0009 -0.0007 -0.0006 5.6765 20.9961 31.1202 32.1847
frequency: 20.7979 31.1028 32.1546 53.6061 60.1620 66.7239 73.7610 82.0630 92.4867 96.7740 125.9739 138.3887 146.4458 155.1300 164.4859 167.1449 171.7823 181.9306 191.7510 209.7964 229.1211 253.2340 256.1207 267.4936 280.8990 306.0806 326.4877 328.7809 351.4893 362.3583 413.7112 443.3340 449.6455 480.1300 488.0893 506.8640 522.4414 545.4612 579.6680 584.5420 596.9574 609.7249 632.2813 642.2146 657.6026 665.9928 679.3515 689.2021 732.5991 747.0878 755.8790 767.4154 770.7625 784.1640 816.7701 839.3747 868.0079 886.6273 895.2948 905.4014 909.7641 929.8395 934.5690 942.8476 943.8443 951.9959 978.7555 988.3284 1028.1457 1034.3361 1042.0528 1072.3714 1075.9860 1083.2792 1110.3388 1111.7305 1113.2355 1114.8607 1129.0299 1132.0296 1150.8586 1156.0657 1158.8868 1166.2525 1183.8970 1185.8825 1188.2653 1216.1086 1231.8231 1242.8045 1248.7523 1269.0320 1296.1305 1323.8351 1330.9478 1344.4979 1357.5120 1365.7624 1393.9003 1402.9977 1416.1578 1426.0186 1433.7697 1434.6627 1447.9749 1456.1002 1458.3457 1460.3769 1461.8547 1465.4431 1476.0864 1480.0943 1482.2293 1483.2004 1484.7485 1560.8106 1588.2916 1604.3857 1609.2202 1628.5127 1666.7652 2947.2615 2965.4364 2972.0859 2975.3011 2976.2040 3001.7332 3004.3415 3041.8558 3070.6994 3075.3007 3079.1771 3097.9453 3112.8439 3119.4427 3119.5631 3122.2123 3139.0945 3153.5403 3183.8241 3185.0795
redmass: 5.0733 4.8505 5.3819 4.2046 4.1062 4.2383 3.8594 3.1615 3.1980 2.6108 4.2001 3.8806 3.9146 2.6080 1.7111 1.1104 1.1840 3.4846 4.1189 3.7807 4.8063 5.8588 4.8967 5.5722 6.0659 6.0861 4.7825 4.7319 5.1013 5.5483 5.9024 5.8826 4.6395 5.7844 5.0273 4.7344 5.3738 5.1064 5.4344 5.6983 5.3524 5.8617 4.9523 6.1387 4.6877 6.3141 6.4435 8.8968 7.5889 5.8723 5.0201 5.0612 5.9593 6.3069 1.4211 8.5840 5.7958 1.8301 1.5809 1.7646 4.2743 3.7810 1.6635 3.9920 5.2705 9.0979 4.8352 5.6202 6.4604 2.8156 4.8118 1.5764 2.6698 2.2072 1.2937 1.2385 1.3111 2.0220 1.1229 1.6881 1.3558 1.4487 1.4417 1.2204 3.7652 1.2776 2.2067 1.4475 1.9243 4.4431 2.3830 1.4308 1.5202 3.2901 2.0802 1.5673 4.7714 1.3910 2.5671 4.1125 1.2975 4.1534 1.2331 1.4943 1.4073 1.4439 1.0540 1.0625 1.6965 2.2300 1.0583 1.0874 1.0542 1.1427 1.0606 7.6203 8.5142 7.5280 9.6010 8.8874 12.8089 1.0689 1.0798 1.0308 1.0300 1.0308 1.0643 1.0603 1.0951 1.1037 1.1054 1.1027 1.1026 1.1110 1.1031 1.1029 1.1035 1.0901 1.0919 1.0927 1.0955
irintensity: 0.4313 2.1839 2.1196 0.3395 6.9538 5.1995 1.0814 2.3556 6.0019 12.0521 2.0099 1.9392 0.9530 1.7946 0.7918 0.0512 0.3360 3.6800 3.3147 8.8986 3.8597 12.2783 0.8334 5.7315 9.7102 1.7215 2.0114 1.2630 2.6791 2.1848 6.5609 4.0543 3.4402 1.3020 5.4749 2.0863 0.0964 0.3313 1.1034 1.6990 4.0780 7.9893 7.7121 10.0359 5.8216 2.4434 1.7850 1.0584 5.0030 9.0848 29.8327 9.4974 27.1952 9.4913 38.3711 51.1875 3.1345 8.3718 18.4159 11.3154 75.3960 48.2257 29.7152 74.9865 10.5173 111.6700 39.0113 23.0601 129.1486 97.1025 173.8248 5.2364 42.9400 38.4513 10.3761 3.9153 2.9165 0.8968 3.5217 4.0088 0.7885 4.1036 13.4573 25.9483 196.7574 0.9342 6.4981 15.0511 33.9276 145.9972 60.6688 21.8209 6.4386 134.8494 39.3334 3.2020 47.3710 8.9684 52.0796 15.0150 2.0677 119.8918 31.8561 10.6750 30.3273 51.6190 16.5224 0.8310 8.0990 22.0982 4.7118 9.0345 13.0756 0.7483 34.1587 78.3434 44.9641 19.9420 117.9849 13.5709 290.1243 16.7034 18.1323 73.0119 73.9703 67.8356 72.2596 87.0934 30.7146 26.2453 22.1428 26.3401 31.6736 22.5931 19.4639 34.5837 23.1757 11.6067 2.2084 0.1303 4.4786
temp: 298.150 k
press: 1.00000 atm
elementType: 8 8 8 8 8 8 8 6 6 6 6 6 6 6 6 6 6 6 6 6 6 6 6 6 6 6 6 6 6 1 1 1 1 1 1 1 1 1 1 1 1 1 1 1 1 1 1 1 1
symmnumber: 1
zpe: 980283.9 jmol-1
zpe.correction: 0.373370 hartree
zpe.thermalcorrener: 0.400126 hartree
zpe.thermalcorrenthalpy: 0.401071 hartree
zpe.thermalcorrgfe: 0.315181 hartree
zpe.sumelectzpe: -1374.734983 hartree
zpe.sumelectthermal: -1374.708227 hartree
zpe.sumelectthermalent: -1374.707283 hartree
zpe.sumelectthermalfe: -1374.793172 hartree
dipole: -1.8186 -4.1443 1.5980
dipole: 4.7996
quadrupole: -130.0277 -179.5681 -163.8009
quadrupole: -9.8833 -0.2141 2.7381
quadrupole: 27.7712 -21.7692 -6.0020 -9.8833 -0.2141 2.7381
hfenergy: -1375.108353 hartree
pointgroup: C01 [X(C22H20O7)]
dipole: -0.8156174 0.9980153 -1.3800401 debye
polarizability: 338.4006617|35.9581329|280.998466|24.5262456|-51.4753828|217.2629196 unknown
InChI: InChI=1S/C22H20O7/c1-24-15-7-12(8-16(25-2)20(15)26-3)17-18-11(4-5-14-21(18)29-10-28-14)6-13-9-27-22(23)19(13)17/h4-5,7-8,13H,6,9-10H2,1-3H3
charge 0 multiplicity 1
49 atoms
O  -1.709943 -3.914702 1.759588
O  -0.738235 2.480618 -0.191086
O  -2.361488 3.851506 -1.288633
O  0.410009 -2.972226 1.837177
O  2.849935 0.7158 -2.400742
O  3.264004 0.36069 2.516359
O  4.492825 0.886273 -0.027889
C  -3.02662 -2.074904 0.874422
C  -3.64881 -1.657943 -0.470487
C  -1.544082 -1.725619 0.895639
C  -3.354885 -0.187821 -0.735025
C  -1.064576 -0.568497 0.314499
C  -2.062676 0.322115 -0.334924
C  -3.028054 -3.599768 1.144348
C  -0.786539 -2.844866 1.516476
C  -1.847334 1.693713 -0.580782
C  0.383743 -0.209568 0.241129
C  -4.302568 0.641994 -1.363818
C  -2.812851 2.510462 -1.212888
C  -4.050347 2.019324 -1.622884
C  1.190204 -0.148268 1.400335
C  0.963617 0.068709 -1.023185
C  -0.952933 3.810111 -0.818265
C  2.325116 0.405424 -1.121493
C  2.549802 0.216044 1.312432
C  3.13034 0.511466 0.047778
C  3.914541 -0.202465 -2.86879
C  4.467439 -0.489857 2.661576
C  4.701571 2.308903 -0.393093
H  -3.54589 -1.542973 1.698634
H  -4.739125 -1.838565 -0.478228
H  -3.207062 -2.285557 -1.27443
H  -3.800674 -3.930361 1.855243
H  -3.110124 -4.17952 0.205483
H  -5.267389 0.216113 -1.659864
H  -4.790861 2.665014 -2.100525
H  0.782472 -0.371898 2.388407
H  0.37377 0.015256 -1.943609
H  -0.275953 3.910685 -1.687176
H  -0.801441 4.590231 -0.057047
H  3.508163 -1.224873 -2.98767
H  4.762336 -0.213734 -2.160997
H  4.232133 0.191104 -3.846609
H  5.19768 -0.271399 1.863935
H  4.179233 -1.558024 2.640988
H  4.883075 -0.232903 3.647896
H  4.264735 2.965784 0.381512
H  4.24973 2.523534 -1.378414
H  5.793186 2.445839 -0.432003
