program: Gaussian 09
title: 000275902
version: EM64L-G09RevD.01
frameworkgroup: C1[X(C16H15Cl)]
method: RPBEPBE
basis: SDD
operation: Freq
keyword: #p
keyword: freq=noraman
keyword: PBEPBE/SDD
title: #p freq=noraman PBEPBE/SDD
converged: YES YES NO NO
title: Mulliken charges:
elementType: Cl C C C C C C C C C C C C C C C C H H H H H H H H H H H H H H H
charge: -0.043899 0.283290 0.297548 0.431704 -0.420067 -0.390835 -0.382262 -0.383161 0.433333 0.433134 -0.387856 -0.391075 -0.383669 -0.391482 -0.807285 -0.807894 -0.680893 0.249384 0.255199 0.255956 0.253220 0.230403 0.229946 0.231343 0.230451 0.226049 0.225566 0.237459 0.237972 0.224764 0.225311 0.278346
chargesum: 0.00000
title: Mulliken charges with hydrogens summed into heavy atoms:
elementType: Cl C C C C C C C C C C C C C C C C
charge: -0.043899 0.283290 0.297548 0.431704 -0.170683 -0.135636 -0.126306 -0.129941 0.433333 0.433134 -0.157452 -0.161129 -0.152326 -0.161031 -0.118211 -0.119847 -0.402548
polarizability: 2.60016973e+02 4.12023391e+00 1.96662054e+02 -1.39331426e+01 1.62496337e+00 1.13517203e+02
1716.lowfreq: -7.4278 -0.0022 -0.0015 -0.0011 3.1820 6.1444 22.4001 23.0335 38.5888
frequency: 22.1517 22.8551 38.5091 51.0741 62.3767 65.1959 114.5278 144.0786 165.0763 219.5530 250.7201 268.3205 294.5054 330.8654 349.2861 363.3683 406.8762 412.6147 458.9233 477.3088 519.0652 569.9955 617.2019 634.2735 649.7977 652.1970 719.3258 731.6603 747.7576 775.2491 786.5176 804.5900 833.6205 839.3238 851.0297 855.5407 919.0187 959.7208 963.8739 977.1390 980.1584 987.5744 988.5706 1012.7095 1014.9734 1046.5035 1047.2636 1126.3840 1128.4022 1156.7043 1196.5583 1200.3970 1224.7083 1226.9221 1238.3136 1304.1683 1310.6369 1326.9028 1358.6741 1363.0593 1396.4471 1399.0500 1406.2929 1407.8772 1469.6285 1470.2334 1472.5249 1473.8329 1500.9942 1507.0146 1565.6626 1570.7161 1594.9605 1620.2124 1622.1705 2974.5788 2974.6991 3055.7124 3055.8094 3084.9309 3085.3064 3117.9408 3120.2974 3121.6217 3122.7231 3143.3609 3148.6707 3151.8231 3163.0264 3193.7982
redmass: 1.0314 1.0351 3.5628 4.1924 5.3363 3.8452 6.5204 4.3418 4.7811 3.8521 6.9196 4.4973 4.0551 4.8740 2.8205 3.0589 2.8753 2.9071 4.2174 3.1094 3.8356 4.1098 4.3899 6.4975 5.0685 4.8131 3.8226 2.8437 3.7911 1.4521 4.2123 4.5811 1.6285 1.6153 1.2495 1.2443 4.4930 1.3331 1.3655 1.3762 1.3705 1.4082 1.4028 3.0397 2.7678 1.5677 1.5598 1.3235 1.3283 3.2427 1.1092 1.1235 3.0275 2.8650 1.6210 1.4074 1.2977 1.9217 4.7534 5.0405 1.2229 1.2237 3.3418 3.2397 1.0948 1.0969 1.0559 1.0547 2.5858 2.7456 6.0239 5.8289 8.7216 6.3835 6.3480 1.0387 1.0387 1.0949 1.0947 1.0998 1.0998 1.0877 1.0882 1.0882 1.0890 1.0957 1.0957 1.0962 1.0952 1.0939
irintensity: 0.5398 0.6552 0.0703 0.4207 0.4281 0.0304 0.3798 0.4979 1.6621 0.6602 1.3414 0.2061 0.4951 4.7973 0.2421 0.1248 0.3370 0.1360 2.0824 20.5164 14.1535 12.4857 5.5284 0.0164 2.8765 1.1344 21.1535 2.9395 53.8134 63.8790 4.5716 9.0808 50.0734 14.3037 0.2587 0.1104 11.8420 1.2406 2.3432 0.6258 0.1682 0.5206 0.8816 2.0375 6.4082 23.2978 17.8995 9.1767 7.9343 2.9532 9.7212 1.3263 1.9641 0.4396 7.7039 1.8853 2.8459 6.8824 3.3009 1.2942 10.1569 9.2009 4.3258 2.9171 15.4558 13.9808 13.0198 12.6468 10.2707 49.1539 4.3486 0.8632 11.0017 14.7840 7.8591 64.3351 14.0457 22.2070 22.3185 17.7609 17.3879 13.7516 11.2019 25.8054 22.4108 23.7526 16.2625 4.0995 4.3178 9.5794
temp: 298.150 k
press: 1.00000 atm
elementType: 17 6 6 6 6 6 6 6 6 6 6 6 6 6 6 6 6 1 1 1 1 1 1 1 1 1 1 1 1 1 1 1
symmnumber: 1
zpe: 670845.4 jmol-1
zpe.correction: 0.255512 hartree
zpe.thermalcorrener: 0.271963 hartree
zpe.thermalcorrenthalpy: 0.272907 hartree
zpe.thermalcorrgfe: 0.208133 hartree
zpe.sumelectzpe: -1077.560462 hartree
zpe.sumelectthermal: -1077.544011 hartree
zpe.sumelectthermalent: -1077.543067 hartree
zpe.sumelectthermalfe: -1077.607841 hartree
dipole: -1.3473 -2.3185 -0.1353
dipole: 2.6850
quadrupole: -89.7567 -105.9668 -107.1483
quadrupole: -5.2315 -3.2163 -0.0769
quadrupole: 11.2005 -5.0095 -6.1910 -5.2315 -3.2163 -0.0769
hfenergy: -1077.8159736 hartree
pointgroup: C01 [X(C16H15Cl1)]
dipole: -0.4830997 -0.9381076 -0.0492725 debye
polarizability: 255.7841279|8.6355379|197.1335361|-26.2986202|3.5107384|117.2785659 unknown
InChI: InChI=1S/C16H15Cl/c1-12-3-7-14(8-4-12)16(11-17)15-9-5-13(2)6-10-15/h3-11H,1-2H3
charge 0 multiplicity 1
32 atoms
Cl 1.371636 3.718814 0.091501
C  -1.320939 0.512059 0.113965
C  1.241234 0.416829 -0.086179
C  -0.005763 1.231195 0.021171
C  -2.354564 0.964301 0.979032
C  2.296488 0.762399 -0.972792
C  -1.572548 -0.642528 -0.67722
C  1.388875 -0.760147 0.697983
C  -3.857385 -0.840559 0.230138
C  3.61663 -1.195243 -0.260044
C  -3.59812 0.300231 1.032345
C  3.457313 -0.033144 -1.05859
C  -2.817019 -1.301881 -0.618819
C  2.556591 -1.545571 0.615887
C  -5.205794 -1.537696 0.267881
C  4.886676 -2.024587 -0.327408
C  -0.059838 2.595199 0.036136
H  -2.167002 1.818571 1.639581
H  2.199225 1.647224 -1.608855
H  -0.788012 -1.017339 -1.343456
H  0.582947 -1.055193 1.378984
H  -4.37418 0.663662 1.717203
H  4.252891 0.250613 -1.75848
H  -2.986333 -2.187894 -1.242951
H  2.647321 -2.443765 1.23894
H  -5.111647 -2.615992 0.049211
H  -5.691518 -1.429135 1.253655
H  -5.89472 -1.109064 -0.486149
H  5.639875 -1.653725 0.395125
H  4.693407 -3.084167 -0.08381
H  5.347043 -1.980809 -1.330294
H  -0.99137 3.163441 0.04391
