program: Gaussian 09
title: 000270342
version: EM64L-G09RevD.01
frameworkgroup: C1[X(C20H26)]
method: RPBEPBE
basis: SDD
operation: Freq
keyword: #p
keyword: freq=noraman
keyword: PBEPBE/SDD
title: #p freq=noraman PBEPBE/SDD
converged: YES YES NO NO
title: Mulliken charges:
elementType: C C C C C C C C C C C C C C C C C C C C H H H H H H H H H H H H H H H H H H H H H H H H H H
charge: -0.108549 -0.108550 -0.067382 -0.067382 0.148944 0.148945 0.148946 0.148945 -0.445457 -0.445458 -0.445457 -0.445457 -0.517470 -0.517471 -0.517469 -0.517469 -0.449225 -0.449227 -0.449227 -0.449227 0.203301 0.203302 0.202102 0.200871 0.202103 0.200872 0.202103 0.200872 0.202102 0.200871 0.221105 0.215424 0.221104 0.215424 0.215425 0.221104 0.215424 0.221104 0.201201 0.208820 0.201201 0.208820 0.208821 0.201202 0.208820 0.201201
chargesum: 0.00000
title: Mulliken charges with hydrogens summed into heavy atoms:
elementType: C C C C C C C C C C C C C C C C C C C C
charge: 0.094752 0.094752 -0.067382 -0.067382 0.148944 0.148945 0.148946 0.148945 -0.042484 -0.042484 -0.042483 -0.042484 -0.080941 -0.080942 -0.080941 -0.080941 -0.039204 -0.039205 -0.039205 -0.039205
polarizability: 2.50290849e+02 4.49328197e-06 2.29613955e+02 1.78563534e+00 7.53695897e-05 1.35970758e+02
1716.lowfreq: -21.7012 -13.3586 -9.9697 -0.0007 -0.0007 0.0002 40.4624 68.4355 86.8149
frequency: 40.4624 68.4355 86.8013 127.2404 131.1494 157.2221 205.7728 219.1855 244.7613 276.6822 280.8372 292.8170 328.9619 331.7554 356.2479 375.1053 381.9746 394.8330 435.1407 454.1955 473.3392 484.0176 492.5074 511.5338 549.5364 562.8724 586.7317 596.2011 646.3374 684.7751 736.4339 740.4585 803.2492 833.0566 839.4854 841.1446 859.2770 884.3864 890.2012 891.1390 892.5808 916.1963 925.7923 934.4386 938.7191 978.1569 987.2918 1019.7767 1034.1433 1035.5927 1062.4200 1083.1044 1084.4948 1085.9241 1101.4263 1117.0333 1119.0028 1126.8291 1131.8116 1141.1607 1141.2397 1148.3166 1152.1304 1178.7923 1187.7667 1197.1466 1222.1262 1250.1650 1251.3494 1251.4874 1265.3627 1269.8677 1287.1707 1290.8506 1297.8236 1307.8089 1317.7773 1319.4923 1328.8077 1329.3449 1332.2763 1333.5860 1337.8712 1345.1736 1346.2150 1346.4190 1351.7711 1354.7815 1360.2584 1367.2283 1411.2160 1415.0068 1443.9344 1456.0564 1458.9567 1460.4890 1462.2597 1466.9895 1468.2278 1469.4339 1471.6418 1471.8837 1473.0079 1474.3605 1562.6397 1577.1960 2904.5942 2904.7178 2939.8973 2940.2059 2940.2892 2940.4528 2966.4036 2966.4286 2970.6381 2970.8935 2970.9442 2971.6668 2972.1938 2973.2097 2995.1637 2995.7013 3001.9246 3002.5410 3024.6267 3024.6297 3029.9239 3030.7306 3037.0798 3037.2704 3040.0329 3040.1824
redmass: 3.1808 2.7574 2.3022 2.3549 2.2038 3.0856 2.3381 3.8956 1.8418 2.1801 2.8811 1.7820 3.1292 2.8734 2.9218 3.5219 4.3497 2.7131 3.7745 3.7800 3.8021 3.1637 3.1608 1.9638 2.4756 3.5088 2.3541 2.4007 5.4992 2.5107 3.5825 4.0468 2.2790 1.6625 1.8509 1.4795 1.5070 1.5969 1.8310 3.0061 2.8497 2.8509 2.3844 2.5964 2.4196 1.8163 1.6090 1.9180 2.5386 2.0508 2.6045 1.7677 1.9453 2.3054 2.1174 1.9103 1.3301 1.4385 2.1299 1.6224 1.5448 1.4557 1.2647 1.4388 1.4293 1.6580 1.6727 1.8114 1.2192 1.2475 1.2374 1.4000 1.6591 2.3130 1.2180 1.4088 1.5686 1.5228 1.3987 1.4251 1.5842 1.6918 1.5173 1.6016 1.4819 1.5976 1.4927 1.5213 1.8951 2.2838 4.3316 3.4153 1.1104 1.2532 1.1090 1.0875 1.0935 1.1288 1.0858 1.0954 1.0897 1.0932 1.0958 1.0935 8.4430 8.1640 1.0809 1.0809 1.0647 1.0659 1.0646 1.0659 1.0597 1.0597 1.0606 1.0589 1.0671 1.0664 1.0649 1.0663 1.0898 1.0891 1.0910 1.0905 1.0998 1.0998 1.0989 1.0984 1.1034 1.1034 1.1035 1.1034
irintensity: 0.0527 0.0487 0.0000 0.0000 0.1438 4.4560 0.0000 0.1492 3.5692 0.0000 0.0000 0.8428 0.0000 0.0000 0.0000 0.0084 0.0000 1.2846 0.5212 0.0000 0.0000 0.0000 1.6150 0.0282 0.0000 0.1972 0.0000 1.9548 3.0721 0.0000 2.7733 0.0000 10.2875 18.5472 0.0000 0.0000 0.1136 1.9093 0.0000 2.4112 0.0000 0.0000 0.0000 0.0000 7.7784 4.2032 0.0000 0.0134 0.0000 3.3561 5.3372 0.5719 0.0000 0.0000 0.0000 3.7478 0.0000 0.2913 0.0000 0.0000 3.5543 0.8233 0.0000 4.9416 0.0000 0.6236 0.0000 10.9223 5.4385 0.0000 0.0000 11.6569 0.0764 0.0000 0.0000 6.9260 6.2895 0.0000 0.0000 0.0000 4.2950 3.0136 4.1666 0.0000 0.0000 0.0452 0.0000 0.3317 0.0000 4.6531 14.3389 2.9649 0.0000 30.5169 0.0824 0.0000 0.0000 0.2249 0.0000 32.5115 0.0000 17.1169 16.2398 0.0000 0.0000 0.0000 42.8943 0.0595 92.6509 0.0044 0.0051 42.0249 0.0002 1.1303 96.9671 0.0001 0.0010 159.3850 50.4189 0.0001 0.0000 71.4258 102.6291 0.0000 43.6882 0.5510 223.1852 0.0000 0.0027 80.6779 0.0048 210.1342
temp: 298.150 k
press: 1.00000 atm
elementType: 6 6 6 6 6 6 6 6 6 6 6 6 6 6 6 6 6 6 6 6 1 1 1 1 1 1 1 1 1 1 1 1 1 1 1 1 1 1 1 1 1 1 1 1 1 1
symmnumber: 1
zpe: 1073159.2 jmol-1
zpe.correction: 0.408745 hartree
zpe.thermalcorrener: 0.425246 hartree
zpe.thermalcorrenthalpy: 0.426190 hartree
zpe.thermalcorrgfe: 0.365943 hartree
zpe.sumelectzpe: -776.270820 hartree
zpe.sumelectthermal: -776.254319 hartree
zpe.sumelectthermalent: -776.253375 hartree
zpe.sumelectthermalfe: -776.313621 hartree
dipole: 0.0000 0.0000 0.0000
dipole: 0.0000
quadrupole: -116.2193 -115.3645 -121.5842
quadrupole: 0.0000 0.9140 0.0000
quadrupole: 1.5034 2.3582 -3.8615 0.0000 0.9140 0.0000
hfenergy: -776.6795646 hartree
pointgroup: C01 [X(C20H26)]
dipole: 0. -0.0000023 -0.0000013 debye
polarizability: 250.2767356|-0.0001912|229.6139547|-2.1912806|0.000325|135.9848716 unknown
InChI: InChI=1S/C20H26/c1-5-13-6-2-11-17-18-12-4-8-14-7-3-10-16(20(14)18)15(9-1)19(13)17/h13-14H,1-12H2
charge 0 multiplicity 1
46 atoms
C  -2.961044 0.000032 0.213923
C  2.961045 -0.000025 -0.213868
C  -1.426827 0.000019 0.096873
C  1.426828 -0.00001 -0.096822
C  -0.711707 1.230817 0.048257
C  0.711733 1.230803 -0.0482
C  -0.711733 -1.230793 0.048249
C  0.711708 -1.230808 -0.048207
C  -3.579488 1.286501 -0.371742
C  3.579511 1.286425 0.371816
C  -3.57951 -1.286413 -0.371772
C  3.579483 -1.28649 0.371814
C  -1.439329 2.578817 0.049309
C  1.439382 2.578788 -0.049247
C  -1.439381 -2.578779 0.049289
C  1.439328 -2.578808 -0.049259
C  -2.956542 2.507976 0.327323
C  2.956597 2.507919 -0.327245
C  -2.956598 -2.507912 0.32728
C  2.956546 -2.507969 -0.327251
H  -3.213623 0.000022 1.300178
H  3.213628 -0.000027 -1.300121
H  -4.677328 1.26845 -0.225004
H  -3.393717 1.334761 -1.464273
H  4.677351 1.268353 0.225088
H  3.39373 1.334678 1.464345
H  -4.67735 -1.268342 -0.225045
H  -3.393727 -1.334657 -1.464301
H  4.677325 -1.26844 0.225089
H  3.393698 -1.334741 1.464343
H  -0.964736 3.262451 0.781022
H  -1.281337 3.058825 -0.941079
H  0.964809 3.262429 -0.780969
H  1.281388 3.058803 0.941136
H  -1.281381 -3.05879 -0.941095
H  -0.964812 -3.262422 0.781011
H  1.28132 -3.058825 0.941121
H  0.964745 -3.262435 -0.780986
H  -3.135825 2.419116 1.417898
H  -3.436813 3.449252 -0.001441
H  3.135891 2.419065 -1.417818
H  3.436883 3.449182 0.001533
H  -3.436881 -3.449173 -0.001509
H  -3.135898 -2.41907 1.417853
H  3.436811 -3.449243 0.001527
H  3.135846 -2.419117 -1.417823
