program: Gaussian 09
title: 000275889
version: EM64L-G09RevD.01
frameworkgroup: C1[X(C16H11Br)]
method: RPBEPBE
basis: SDD
operation: Freq
keyword: #p
keyword: freq=noraman
keyword: PBEPBE/SDD
title: #p freq=noraman PBEPBE/SDD
converged: YES YES NO NO
title: Mulliken charges:
elementType: Br C C C C C C C C C C C C C C C C H H H H H H H H H H H
charge: -0.025071 0.089456 0.194050 -0.788961 -0.663064 0.205112 0.205706 0.345137 0.283956 -0.420814 -0.403437 -0.393578 -0.428064 -0.225388 -0.235563 -0.239593 -0.237758 0.324231 0.254251 0.251425 0.245828 0.252704 0.254419 0.243043 0.228260 0.227308 0.230310 0.226096
chargesum: 0.00000
title: Mulliken charges with hydrogens summed into heavy atoms:
elementType: Br C C C C C C C C C C C C C C C C
charge: -0.025071 0.089456 0.194050 -0.464730 -0.157388 0.205112 0.205706 0.345137 0.283956 -0.174986 -0.150733 -0.139158 -0.185021 0.002871 -0.008255 -0.009283 -0.011662
polarizability: 3.08793263e+02 2.38731523e+01 2.06093622e+02 -2.46447004e+00 1.54650628e+01 9.17606699e+01
1716.lowfreq: -1.3646 -0.0004 -0.0004 -0.0002 3.1416 5.5008 53.4266 63.2037 86.9488
frequency: 53.4152 63.1864 86.9450 119.6066 145.2557 177.1459 223.6090 248.8664 301.9505 331.6604 388.1813 414.5845 421.9444 433.4581 528.9373 538.6382 560.3292 579.9337 595.8221 622.3578 665.2633 679.9874 725.9859 756.6522 760.5246 764.4506 773.4651 783.5265 826.0751 868.0936 878.1984 890.4571 922.9370 948.0967 956.9347 986.2630 986.3817 1011.9132 1019.9988 1028.5625 1068.7201 1101.4091 1112.1095 1114.2886 1116.5810 1155.0135 1163.9964 1172.4069 1181.8691 1187.4467 1200.8690 1276.6181 1285.1326 1328.9441 1377.5498 1399.5479 1406.4002 1419.1236 1442.6004 1452.9635 1466.3126 1482.3444 1544.7216 1589.3042 1594.5739 1613.1428 1623.7193 2982.8448 3026.6987 3076.0152 3123.3972 3128.2142 3133.7563 3137.3276 3147.8988 3148.5166 3163.7120 3165.8834
redmass: 5.0817 7.5303 7.8744 4.1562 4.8281 4.1306 5.0948 2.8573 5.7285 4.7350 4.8874 3.5582 3.1159 2.9714 3.4831 4.6685 5.3336 5.2454 4.2873 6.5924 5.8520 3.8543 1.9455 2.6003 1.9962 2.1028 4.3343 2.7272 4.6646 1.3687 1.5101 4.5944 1.8961 1.4145 1.6497 1.3366 1.3258 3.3909 2.1356 2.4806 4.2671 1.8360 1.4201 1.4494 1.1691 1.5864 1.3637 1.1288 1.7027 1.5239 1.8354 1.7634 1.4738 3.2037 7.3202 2.6485 2.1102 1.3677 2.4573 2.5669 4.7343 5.6758 6.6244 6.8631 6.6105 7.3447 7.5758 1.0611 1.0982 1.0868 1.0861 1.0855 1.0894 1.0898 1.0945 1.0950 1.1003 1.1002
irintensity: 0.2763 0.7348 0.4028 0.0991 1.0680 1.2886 1.8293 5.8745 0.4325 0.1825 0.0770 5.0692 7.3720 17.6391 7.4277 3.8833 6.3248 0.7503 18.6868 6.2778 12.9843 33.4992 7.1611 10.2882 36.9698 106.9579 1.7678 10.4923 6.7052 2.1469 2.5012 3.7246 0.2607 3.9246 3.1372 0.0777 0.0458 0.0520 15.0808 0.2124 3.7996 0.8024 1.0201 25.3637 10.0953 7.7637 0.6664 0.1033 0.8627 0.1336 8.1307 1.8487 0.7217 1.9427 0.9781 5.5930 23.2637 23.9074 1.0039 12.9309 3.2888 10.2112 3.1411 0.7906 2.8764 10.1348 25.2014 7.7518 5.3035 2.4278 2.8441 3.2576 9.1091 2.6263 23.6582 26.1347 38.3980 31.0210
temp: 298.150 k
press: 1.00000 atm
elementType: 35 6 6 6 6 6 6 6 6 6 6 6 6 6 6 6 6 1 1 1 1 1 1 1 1 1 1 1
symmnumber: 1
zpe: 563330.9 jmol-1
zpe.correction: 0.214561 hartree
zpe.thermalcorrener: 0.227492 hartree
zpe.thermalcorrenthalpy: 0.228436 hartree
zpe.thermalcorrgfe: 0.173882 hartree
zpe.sumelectzpe: -628.626144 hartree
zpe.sumelectthermal: -628.613213 hartree
zpe.sumelectthermalent: -628.612269 hartree
zpe.sumelectthermalfe: -628.666823 hartree
dipole: -0.0119 -2.6694 0.8056
dipole: 2.7883
quadrupole: -93.8500 -99.3564 -110.3969
quadrupole: 1.1132 -1.9241 7.0575
quadrupole: 7.3511 1.8447 -9.1958 1.1132 -1.9241 7.0575
hfenergy: -628.8407051 hartree
pointgroup: C01 [X(C16H11Br1)]
dipole: 0.0976512 0.9840771 0.4748753 debye
polarizability: 312.1279077|14.5253162|204.915042|1.5416501|2.0622802|89.6046059 unknown
InChI: InChI=1S/C16H11Br/c17-16-13-8-4-3-7-12(13)14-9-10-5-1-2-6-11(10)15(14)16/h1-8,16H,9H2
charge 0 multiplicity 1
28 atoms
Br 0.65532 -2.98626 -1.016345
C  0.237735 0.809812 -0.058088
C  -0.321921 -0.437878 0.163001
C  0.754013 -1.460895 0.383529
C  -0.838115 1.855586 -0.243436
C  1.70077 0.723086 -0.022607
C  -1.780017 -0.354458 0.146011
C  2.038718 -0.650724 0.235678
C  -2.117215 1.023133 -0.094657
C  2.718545 1.686769 -0.172535
C  -2.794251 -1.324645 0.308837
C  3.373833 -1.056908 0.339963
C  -3.459707 1.423996 -0.163593
C  4.071104 1.27046 -0.069001
C  -4.145236 -0.909737 0.237958
C  4.398088 -0.082304 0.184079
C  -4.477497 0.448056 0.006422
H  0.679538 -2.032009 1.322432
H  -0.779625 2.345593 -1.235985
H  -0.778635 2.664906 0.510949
H  2.475598 2.738121 -0.361216
H  -2.541555 -2.376992 0.475581
H  3.628591 -2.107539 0.517406
H  -3.726192 2.47151 -0.346241
H  4.874278 2.006425 -0.186952
H  -4.946089 -1.647415 0.360796
H  5.44898 -0.382253 0.256687
H  -5.530555 0.746363 -0.044472
