program: Gaussian 09
title: 000275883
version: EM64L-G09RevD.01
frameworkgroup: C1[X(C15H10Cl2O)]
method: RPBEPBE
basis: SDD
operation: Freq
keyword: #p
keyword: freq=noraman
keyword: PBEPBE/SDD
title: #p freq=noraman PBEPBE/SDD
converged: NO YES NO NO
title: Mulliken charges:
elementType: Cl Cl O C C C C C C C C C C C C C C C H H H H H H H H H H
charge: -0.047523 -0.047525 -0.293236 0.249535 0.249530 0.558501 0.558506 -0.049976 -0.686225 -0.404305 -0.404310 -0.344738 -0.344736 -0.236032 -0.236023 -0.259567 -0.259567 -0.528915 0.286712 0.274840 0.274843 0.236150 0.236150 0.257750 0.257750 0.239004 0.231706 0.231701
chargesum: 0.00000
title: Mulliken charges with hydrogens summed into heavy atoms:
elementType: Cl Cl O C C C C C C C C C C C C C C C
charge: -0.047523 -0.047525 -0.293236 0.249535 0.249530 0.558501 0.558506 -0.049976 -0.399513 -0.129465 -0.129468 -0.344738 -0.344736 0.000119 0.000127 -0.001817 -0.001817 0.173496
polarizability: 2.96938147e+02 -1.28651813e-03 2.32577846e+02 -9.29994932e-04 -5.30374122e+00 7.51270559e+01
1716.lowfreq: -8.5708 -6.4942 -0.0022 -0.0008 0.0003 4.3253 45.3136 72.0633 72.1511
frequency: 45.3136 72.0631 72.1441 99.3155 119.2488 160.9115 165.3464 197.0399 204.2515 244.4053 264.4471 293.3156 299.3337 347.6693 360.3597 371.2424 425.0001 471.9785 486.9771 493.3350 523.8416 559.5924 562.2508 588.2597 651.4721 666.0397 685.3891 746.9577 756.4669 759.6888 803.4926 829.8506 836.8161 864.9636 908.4496 909.5524 916.7118 930.2130 936.6333 982.6743 983.3620 1052.7992 1058.0120 1075.6037 1110.0904 1116.8520 1148.5826 1167.1110 1170.0022 1216.7629 1233.9908 1272.8849 1318.1916 1339.8688 1368.6283 1391.2011 1418.8152 1427.1796 1436.6422 1443.6012 1459.3859 1461.6848 1474.4531 1528.4254 1547.7358 1570.6297 1621.4536 1623.8254 2961.7110 3051.1752 3119.9374 3144.2846 3144.3684 3166.2567 3166.6901 3176.2633 3176.7938 3177.3996
redmass: 6.8077 4.8922 3.4547 4.8667 19.5965 1.0419 4.8178 4.3383 13.6868 3.9926 6.0270 7.9330 6.0549 4.1480 8.1443 8.8159 8.1692 7.7922 6.0952 3.6055 6.1052 4.9893 3.0783 6.2730 6.4290 4.8426 9.0477 2.7942 1.4494 7.2567 1.7390 2.9442 4.7834 4.5067 1.3849 1.4223 1.6559 8.7182 7.3785 1.3244 1.3267 2.2401 1.9357 6.7269 1.2444 2.6504 1.3868 1.1639 1.1857 1.8664 1.5878 2.5577 3.8413 2.0704 2.3189 3.3951 3.7443 4.1172 2.4111 1.9680 1.0530 2.5826 1.0983 7.1003 8.3615 6.0408 7.1337 7.4247 1.0313 1.1045 1.1012 1.0869 1.0869 1.0923 1.0923 1.0919 1.0988 1.0978
irintensity: 0.8165 0.8470 2.8125 2.8850 0.7325 0.0014 1.2958 0.0998 1.7916 2.8279 0.1688 6.4144 1.9672 8.7688 0.0612 2.2139 10.3536 0.0861 1.1677 0.0159 1.4234 0.0919 6.0359 1.7896 7.2951 0.3560 24.9684 0.0951 83.0706 86.6916 0.0162 58.9112 7.7781 0.0000 0.0001 0.4552 29.0134 93.9942 1.4680 0.0029 3.8930 17.0555 9.7395 11.2127 0.3726 14.3991 5.2709 3.0832 8.6051 36.5325 10.9857 0.2846 192.6281 1.0090 0.0518 23.4914 0.0577 0.9133 27.1077 31.1142 12.0686 38.8745 1.2039 0.0273 10.5463 7.5411 19.9221 0.1454 58.3364 29.6958 26.8815 7.0785 6.3111 0.6255 6.8883 0.2734 24.3944 4.2466
temp: 298.150 k
press: 1.00000 atm
elementType: 17 17 8 6 6 6 6 6 6 6 6 6 6 6 6 6 6 6 1 1 1 1 1 1 1 1 1 1
symmnumber: 1
zpe: 531953.4 jmol-1
zpe.correction: 0.202610 hartree
zpe.thermalcorrener: 0.217855 hartree
zpe.thermalcorrenthalpy: 0.218799 hartree
zpe.thermalcorrgfe: 0.159583 hartree
zpe.sumelectzpe: -1571.700454 hartree
zpe.sumelectthermal: -1571.685210 hartree
zpe.sumelectthermalent: -1571.684266 hartree
zpe.sumelectthermalfe: -1571.743482 hartree
dipole: 0.0004 3.8631 1.3729
dipole: 4.0998
quadrupole: -100.8069 -112.5050 -122.1323
quadrupole: 0.0006 0.0000 5.9368
quadrupole: 11.0078 -0.6902 -10.3175 0.0006 0.0000 5.9368
hfenergy: -1571.9030648 hartree
pointgroup: C01 [X(C15H10Cl2O1)]
dipole: -0.0003802 -1.5238876 0.5286516 debye
polarizability: 296.9381445|-0.0104992|232.4886526|0.0135221|6.4934952|75.2162514 unknown
InChI: InChI=1S/C15H10Cl2O/c1-18-15-9-4-2-6-13(16)11(9)8-12-10(15)5-3-7-14(12)17/h2-8H,1H3
charge 0 multiplicity 1
28 atoms
Cl -2.577481 3.214859 0.219543
Cl 2.578404 3.214012 0.219781
O  -0.000483 -2.811383 -0.288735
C  -1.245704 -0.714986 -0.127481
C  1.245369 -0.715397 -0.127337
C  -1.231781 0.740928 0.003525
C  1.231912 0.740524 0.00365
C  -0.000277 -1.400661 -0.163742
C  0.000175 1.431804 0.077012
C  -2.497108 -1.41802 -0.224033
C  2.49655 -1.418851 -0.223709
C  -2.515892 1.395579 0.052548
C  2.516233 1.39475 0.052805
C  -3.700664 -0.723152 -0.173326
C  3.70033 -0.72438 -0.17288
C  -3.71673 0.705687 -0.027068
C  3.716852 0.704458 -0.026664
C  -0.000866 -3.537306 1.001124
H  0.000346 2.51887 0.18449
H  -2.474293 -2.502096 -0.36596
H  2.473383 -2.502926 -0.365583
H  -4.654263 -1.254958 -0.254183
H  4.653764 -1.256504 -0.253596
H  -4.667269 1.245396 0.012182
H  4.667565 1.243854 0.012681
H  -0.001141 -4.606631 0.740769
H  -0.904222 -3.289876 1.591586
H  0.902492 -3.290395 1.591803
