program: Gaussian 09
title: 000275886
version: EM64L-G09RevD.01
frameworkgroup: C1[X(C16H10Br2)]
method: RPBEPBE
basis: SDD
operation: Freq
keyword: #p
keyword: freq=noraman
keyword: PBEPBE/SDD
title: #p freq=noraman PBEPBE/SDD
converged: YES YES NO NO
title: Mulliken charges:
elementType: Br Br C C C C C C C C C C C C C C C C H H H H H H H H H H
charge: -0.006066 -0.006066 0.191980 0.191980 -0.798156 -0.798156 0.223756 0.223756 0.347443 0.347444 -0.403095 -0.403096 -0.394306 -0.394307 -0.227124 -0.227123 -0.236670 -0.236669 0.327236 0.327236 0.257050 0.257051 0.254790 0.254790 0.231366 0.231366 0.231795 0.231794
chargesum: 0.00000
title: Mulliken charges with hydrogens summed into heavy atoms:
elementType: Br Br C C C C C C C C C C C C C C C C
charge: -0.006066 -0.006066 0.191980 0.191980 -0.470920 -0.470920 0.223756 0.223756 0.347443 0.347444 -0.146045 -0.146045 -0.139516 -0.139517 0.004243 0.004243 -0.004875 -0.004875
polarizability: 2.88085600e+02 4.12736111e+01 2.62469115e+02 -9.26648804e-04 5.38328465e-03 1.13545932e+02
1716.lowfreq: -9.4666 -5.4663 -3.9888 -0.0006 -0.0005 -0.0002 31.0880 52.5998 77.5662
frequency: 31.0878 52.5980 77.5660 81.1719 86.1742 128.9991 138.2539 195.8728 222.9593 236.4185 306.3689 349.7734 391.7991 402.4034 420.9798 440.0245 517.0145 557.2986 561.7011 579.0884 605.2589 627.1607 643.5732 666.3949 722.2118 757.4863 763.1879 769.0892 782.4656 783.8026 786.7930 834.9120 881.3173 887.3755 894.4804 951.7778 952.4531 989.8642 990.0373 1012.3562 1019.5784 1033.5609 1066.1667 1101.6831 1105.1848 1113.6723 1114.1589 1153.1405 1160.5298 1173.0899 1179.4755 1183.5035 1196.4980 1275.8440 1284.2172 1322.5729 1378.3574 1399.7089 1411.0707 1442.3722 1451.6953 1465.6319 1484.5307 1539.7283 1593.1414 1596.8898 1612.2021 1620.9969 3075.4355 3075.5932 3131.7357 3131.7660 3141.0177 3141.1074 3153.3100 3153.3652 3168.1184 3168.3106
redmass: 17.4285 8.8805 6.5539 8.3907 7.5516 4.2432 5.3452 5.8858 9.7835 6.1146 6.1017 4.7826 4.8404 6.6147 3.0086 3.7701 4.0948 4.5286 6.7717 5.1508 4.9788 6.3719 4.5930 6.3775 2.3820 4.0902 1.2806 4.3674 2.4122 4.9305 3.1409 4.6000 1.6685 1.4690 3.6486 1.4095 1.4252 1.3400 1.3379 3.0941 2.1494 2.6152 4.8367 1.7589 1.9311 1.1910 1.1266 1.5479 1.4940 1.0902 1.4838 1.5303 1.9067 1.8538 1.4472 2.9900 8.4923 2.8088 2.6684 2.5091 2.5351 4.9690 5.9830 7.4447 6.8462 6.6090 7.3524 7.5638 1.0867 1.0866 1.0856 1.0856 1.0903 1.0903 1.0949 1.0949 1.1004 1.1004
irintensity: 0.2319 0.7461 0.6724 0.3384 0.8661 0.0362 1.7766 1.6541 0.0166 2.2162 0.7243 0.0600 0.7344 21.5515 0.3317 2.3604 26.0461 10.3632 0.0680 0.1147 34.3426 4.8583 65.3487 0.0634 4.3604 2.9555 121.2470 32.4815 1.2357 3.1213 2.5948 10.1829 7.9276 0.8066 5.6107 3.7168 0.1329 0.0848 0.3004 0.0676 11.1661 0.5876 15.0474 1.1342 4.5522 33.5861 13.9299 9.8923 0.0815 0.2101 0.0114 0.0203 2.4466 5.5427 0.0303 0.2536 1.7906 0.0135 30.3913 0.1837 17.7839 0.2749 5.9906 0.0035 0.0002 1.5002 0.0001 28.7431 4.1267 0.2210 2.1856 0.0036 12.5673 0.0000 0.0459 34.9817 60.2260 0.4202
temp: 298.150 k
press: 1.00000 atm
elementType: 35 35 6 6 6 6 6 6 6 6 6 6 6 6 6 6 6 6 1 1 1 1 1 1 1 1 1 1
symmnumber: 1
zpe: 537712.5 jmol-1
zpe.correction: 0.204804 hartree
zpe.thermalcorrener: 0.219335 hartree
zpe.thermalcorrenthalpy: 0.220279 hartree
zpe.thermalcorrgfe: 0.160554 hartree
zpe.sumelectzpe: -641.414590 hartree
zpe.sumelectthermal: -641.400059 hartree
zpe.sumelectthermalent: -641.399115 hartree
zpe.sumelectthermalfe: -641.458840 hartree
dipole: 0.0000 0.0000 -3.0404
dipole: 3.0404
quadrupole: -106.7149 -114.2247 -126.6244
quadrupole: 7.5805 0.0001 0.0000
quadrupole: 9.1398 1.6300 -10.7697 7.5805 0.0001 0.0000
hfenergy: -641.6193941 hartree
pointgroup: C01 [X(C16H10Br2)]
dipole: -0.0000023 -0.0000033 1.1961761 debye
polarizability: 314.7051724|-17.6920729|235.8495423|0.0013704|-0.0052878|113.5459315 unknown
InChI: InChI=1S/C16H10Br2/c17-15-11-7-3-1-5-9(11)13-14(15)10-6-2-4-8-12(10)16(13)18/h1-8,15-16H
charge 0 multiplicity 1
28 atoms
Br -0.741106 -2.910508 -1.434965
Br 0.74112 2.910522 -1.434949
C  0.266034 -0.639179 0.173671
C  -0.266027 0.639186 0.173673
C  -0.836773 -1.657222 0.20733
C  0.83678 1.657229 0.207342
C  1.730319 -0.588172 0.183951
C  -1.730312 0.588179 0.183945
C  -2.099223 -0.801041 0.196457
C  2.09923 0.801048 0.196471
C  2.721346 -1.58944 0.192982
C  -2.721339 1.589447 0.192976
C  -3.444725 -1.186523 0.221502
C  3.444731 1.18653 0.221524
C  4.08324 -1.193681 0.21535
C  -4.083233 1.193687 0.215335
C  -4.443278 -0.17443 0.230943
C  4.443284 0.174436 0.230965
H  -0.782829 -2.382992 1.034188
H  0.782832 2.382996 1.034202
H  2.44903 -2.649694 0.176166
H  -2.449023 2.649701 0.176166
H  -3.726384 -2.245149 0.212245
H  3.726391 2.245156 0.212273
H  4.867908 -1.958129 0.217382
H  -4.867901 1.958136 0.217367
H  -5.50145 -0.456618 0.24429
H  5.501457 0.456624 0.244319
