program: Gaussian 09
title: 000275964
version: EM64L-G09RevD.01
frameworkgroup: C1[X(C24H24N4O6)]
method: RPBEPBE
basis: SDD
operation: Freq
keyword: #p
keyword: freq=noraman
keyword: PBEPBE/SDD
title: #p freq=noraman PBEPBE/SDD
converged: YES YES NO NO
title: Mulliken charges:
elementType: O O O O O O N N N N C C C C C C C C C C C C C C C C C C C C C C C C H H H H H H H H H H H H H H H H H H H H H H H H
charge: -0.203480 -0.293282 -0.240778 -0.236711 -0.269836 -0.301947 -0.138889 -0.186650 -0.647479 -0.615777 -0.344398 -0.169071 0.265428 -0.413521 -0.261127 0.168630 0.237717 0.104892 -0.352219 -0.118226 -0.229791 -0.540716 -0.296327 0.288741 0.230119 -0.848214 -0.265095 0.314838 0.468085 -0.369389 -0.378607 -0.234000 -0.236578 -0.233480 0.331368 0.306071 0.260681 0.269527 0.261118 0.266657 0.242213 0.199428 0.228666 0.247978 0.206111 0.222048 0.288095 0.217883 0.263064 0.333163 0.357884 0.344879 0.343890 0.223421 0.238051 0.229272 0.232147 0.233522
chargesum: 0.00000
title: Mulliken charges with hydrogens summed into heavy atoms:
elementType: O O O O O O N N N N C C C C C C C C C C C C C C C C C C C C C C C C
charge: -0.203480 -0.293282 -0.240778 -0.236711 -0.269836 -0.301947 -0.138889 -0.186650 0.043568 0.072992 -0.013030 0.137000 0.265428 0.116687 -0.000009 0.168630 0.237717 0.104892 0.156651 -0.118226 -0.229791 0.135357 -0.090216 0.288741 0.230119 -0.120189 -0.002031 0.314838 0.468085 -0.145968 -0.140557 -0.004729 -0.004431 0.000042
polarizability: 5.26411897e+02 6.13356908e-01 3.07811032e+02 -1.88895952e+00 4.51130716e+01 2.03947115e+02
1716.lowfreq: -11.2905 -4.7318 0.0003 0.0006 0.0008 2.7674 12.7370 20.4738 24.1321
frequency: 12.6228 20.4293 23.9228 32.1853 35.6715 41.9897 62.3284 73.2964 74.7576 86.9327 90.2181 97.3750 104.3196 113.6134 129.3651 131.5598 132.2368 149.0799 157.1366 168.9579 191.5243 200.3478 212.0909 215.2362 247.3853 261.1542 271.9429 277.0970 288.7756 292.8462 303.0676 323.9749 346.8572 377.2361 391.9098 401.0192 403.3200 422.5455 447.3006 455.7863 462.5574 488.5640 495.7657 507.9634 515.9033 531.1085 544.3252 551.4230 564.9067 578.9134 596.3216 607.7187 615.2108 618.9888 649.1697 676.7449 698.3009 699.0670 699.6959 703.3716 715.2789 723.7508 741.7048 763.1626 772.1002 778.6363 796.4962 818.2647 845.4570 846.5764 859.1506 877.7121 887.7853 897.8585 922.6226 926.3056 935.7755 951.5812 968.4499 979.3568 985.5998 988.7788 996.3865 999.5184 1000.3109 1012.3737 1017.9893 1025.8020 1033.6374 1039.9491 1058.6547 1060.7270 1080.2967 1083.9454 1094.1918 1103.0779 1111.0378 1123.1660 1132.4073 1158.6616 1167.7805 1174.4933 1187.5598 1191.6079 1193.9071 1208.4542 1217.7512 1245.1414 1260.2056 1273.6104 1298.1499 1300.8688 1305.1960 1319.6577 1323.2290 1326.9539 1336.0682 1356.4910 1371.8743 1377.6491 1386.9748 1387.6744 1401.2621 1428.7885 1440.3478 1457.8349 1459.6525 1468.7345 1470.7833 1475.8795 1478.8911 1485.4353 1486.2975 1509.5723 1548.7690 1556.2693 1568.9851 1581.8088 1586.9350 1587.5901 1610.6495 1633.4054 1641.5781 1677.5975 2949.1973 2954.3005 3010.1918 3022.5407 3022.6325 3034.8891 3047.7338 3090.6723 3092.7028 3101.4392 3110.1159 3111.8847 3125.2253 3127.2862 3128.3363 3139.4611 3142.8042 3145.3212 3152.3699 3168.0206 3452.5534 3553.8207 3660.8093 3711.4281
redmass: 6.2480 6.1044 3.8521 6.0463 5.6996 6.0162 7.5401 4.4849 6.1488 2.6978 6.4600 3.2864 3.8897 4.8168 3.7088 3.8736 2.5711 1.2147 4.0695 2.6068 3.4965 6.5980 3.6315 4.7501 9.2935 4.4366 3.3079 3.0743 4.0101 3.7259 4.0025 3.5564 3.9447 6.7746 6.3702 4.5278 2.7692 4.6631 2.8155 5.3708 2.4859 3.0274 4.0454 4.0244 1.1724 1.1080 4.8254 3.5096 6.4457 4.7036 4.7823 4.2711 6.3748 4.9136 5.8180 4.2164 3.5141 2.3475 2.6570 1.5740 3.3148 4.8695 11.4242 4.6728 2.5411 3.2626 6.0375 4.7811 2.4386 1.3057 3.8396 1.8263 4.5243 2.7389 3.2679 1.4413 4.1143 4.0800 2.2356 1.3881 3.6434 5.3611 1.3690 4.8876 2.0264 1.2785 4.4533 2.2264 2.7443 1.4512 2.0615 2.1540 2.4486 1.6103 2.7447 1.7252 1.3479 2.2804 2.4912 1.7550 2.1860 1.0659 3.3877 1.1227 1.2338 1.6295 1.5567 1.7375 1.3187 1.5134 1.8177 1.5625 2.0017 1.9089 1.8592 3.2738 1.3137 3.0448 3.1846 1.6384 7.0864 1.7641 3.1242 1.1398 2.2761 1.0585 1.9879 1.1389 1.0956 1.0718 1.8694 2.3069 1.0485 7.2969 2.8171 10.9925 3.6515 5.7037 1.2607 4.3083 5.9715 3.6447 5.6737 6.5332 1.0385 1.0391 1.0737 1.0979 1.0671 1.0625 1.0936 1.1076 1.0947 1.0897 1.1021 1.0997 1.0860 1.0914 1.0875 1.0907 1.0908 1.0941 1.0962 1.1016 1.0510 1.0447 1.0967 1.1059
irintensity: 0.6940 0.2989 0.1724 0.1667 2.0782 1.6929 1.4798 0.4663 3.0328 2.0464 17.3902 1.3543 1.7052 12.1952 2.9459 2.0015 0.4764 0.1194 3.5256 0.8541 4.3238 1.8928 5.5536 3.0484 4.0987 4.4090 0.8411 1.4974 4.2147 11.8140 1.9520 10.0404 18.4939 30.6197 25.5660 3.9738 0.0375 5.0283 25.9554 3.7997 25.9589 6.5710 15.0147 4.3658 207.6208 59.3702 14.0973 13.2656 36.6299 20.3899 57.9190 8.5737 0.0500 1.7330 6.4793 10.5423 53.5622 9.8163 30.0503 122.2688 12.4059 3.1954 1.7494 20.6110 54.0617 34.7719 7.2074 20.7812 7.3555 1.1957 0.5270 6.3987 9.2319 7.8679 7.2020 0.0476 52.6550 4.4577 3.1914 0.2117 2.3301 4.9238 6.1013 29.4311 65.6940 31.1241 169.6799 6.3926 1.3450 0.7992 32.5694 30.1180 120.9114 15.7245 33.7774 2.1983 2.0131 163.9904 205.8419 20.9998 23.4292 1.7373 3.9903 13.9113 16.0257 29.7462 16.4522 136.5014 2.8565 31.1273 52.4948 89.0167 174.3902 11.7484 81.4369 114.9378 66.0343 106.9944 436.1743 65.7740 33.5482 22.2267 156.5098 10.4692 19.0107 7.4472 143.8399 27.3551 21.4912 18.2755 61.3394 27.3291 16.3284 261.8158 241.6728 202.8458 300.1457 13.5821 115.7077 233.9093 1.6686 44.8491 237.8155 348.8381 48.9551 54.8167 0.8987 26.9140 24.5432 10.8888 62.9045 3.6119 1.4362 0.7950 1.2210 23.1174 5.6426 16.0649 2.3412 14.8538 0.6957 1.7101 40.4874 31.5213 101.5862 71.0639 68.8202 50.7302
temp: 298.150 k
press: 1.00000 atm
elementType: 8 8 8 8 8 8 7 7 7 7 6 6 6 6 6 6 6 6 6 6 6 6 6 6 6 6 6 6 6 6 6 6 6 6 1 1 1 1 1 1 1 1 1 1 1 1 1 1 1 1 1 1 1 1 1 1 1 1
symmnumber: 1
zpe: 1171228.3 jmol-1
zpe.correction: 0.446097 hartree
zpe.thermalcorrener: 0.478153 hartree
zpe.thermalcorrenthalpy: 0.479097 hartree
zpe.thermalcorrgfe: 0.379949 hartree
zpe.sumelectzpe: -1596.807228 hartree
zpe.sumelectthermal: -1596.775173 hartree
zpe.sumelectthermalent: -1596.774229 hartree
zpe.sumelectthermalfe: -1596.873377 hartree
dipole: 0.5978 -3.9803 1.5541
dipole: 4.3146
quadrupole: -147.3798 -217.9627 -184.4363
quadrupole: 3.6756 14.1244 9.3350
quadrupole: 35.8798 -34.7031 -1.1767 3.6756 14.1244 9.3350
hfenergy: -1597.2533257 hartree
pointgroup: C01 [X(C24H24N4O6)]
dipole: 0.3864708 1.1540918 1.1832782 debye
polarizability: 522.7344507|-34.2021637|190.9582532|-5.5745461|7.9428533|324.4773408 unknown
InChI: InChI=1S/C24H24N4O6/c1-12-18(25)21(31)17-14(11-34-23(26)32)24(33-2)22-15(10-27(24)19(17)20(12)30)28(22)16(29)9-8-13-6-4-3-5-7-13/h3-9,14-15,22H,10-11,25-26H2,1-2H3
charge 0 multiplicity 1
58 atoms
O  0.203338 -2.139315 0.559078
O  1.975524 2.080873 0.439122
O  -2.909435 0.017212 -3.016059
O  4.031036 -1.684195 -2.579747
O  4.426986 -0.099265 2.710562
O  -0.100839 3.213338 0.379595
N  -1.303392 -0.625229 -1.446327
N  1.670174 -1.116116 -0.951937
N  6.64637 -0.828245 1.425332
N  1.693545 3.798765 -1.015185
C  -0.340119 0.086655 -0.540495
C  -0.098611 -0.026752 -2.060239
C  0.712204 -0.813759 0.151777
C  1.087638 -0.974523 -2.304903
C  1.626753 -0.229627 1.299993
C  2.960404 -1.058574 -0.50461
C  3.016918 -0.637088 0.823745
C  -2.617163 -0.208518 -1.801764
C  1.537674 1.277018 1.610396
C  4.173722 -1.375667 -1.339295
C  4.261784 -0.523704 1.502601
C  -0.916109 -2.11013 1.502452
C  -3.587515 -0.14548 -0.683854
C  5.454918 -1.304897 -0.656273
C  5.497604 -0.920867 0.689335
C  6.712974 -1.650012 -1.424695
C  -4.894337 0.186225 -0.919899
C  1.080211 3.060508 -0.031531
C  -5.98136 0.30386 0.060101
C  -5.801025 0.096488 1.459759
C  -7.284085 0.641834 -0.408776
C  -6.883613 0.222394 2.350689
C  -8.369115 0.767474 0.483102
C  -8.17319 0.558029 1.86772
H  -0.65028 1.033822 -0.086683
H  -0.257363 0.825251 -2.728693
H  1.839397 -0.561674 -2.994336
H  0.747872 -1.948983 -2.695216
H  1.365204 -0.748487 2.242049
H  2.248163 1.509293 2.421261
H  0.51791 1.591613 1.896569
H  -0.699367 -1.490703 2.397969
H  -1.840607 -1.75035 1.015321
H  -1.056769 -3.156068 1.815485
H  -3.216901 -0.359841 0.324478
H  7.24346 -2.517614 -0.983061
H  6.445001 -1.911952 -2.460885
H  7.425561 -0.801331 -1.462267
H  -5.155263 0.382086 -1.970664
H  7.561475 -1.04818 1.041451
H  6.536013 -0.504376 2.392926
H  1.170497 4.545924 -1.463281
H  2.664857 3.621383 -1.261026
H  -4.810789 -0.161261 1.851527
H  -7.437188 0.804332 -1.482672
H  -6.728651 0.061203 3.423291
H  -9.362597 1.027558 0.102127
H  -9.013006 0.655245 2.564463
