program: Gaussian 09
title: 000275871
version: EM64L-G09RevD.01
frameworkgroup: C1[X(C14H6Cl4)]
method: RPBEPBE
basis: SDD
operation: Freq
keyword: #pfreq=noraman
keyword: PBEPBE/SDD
title: #p freq=noraman PBEPBE/SDD
converged: NO YES NO NO
title: Mulliken charges:
elementType: Cl Cl Cl Cl C C C C C C C C C C C C C C H H H H H H
charge: 0.015496 0.015497 0.052572 0.052571 0.603784 0.603785 0.420502 0.420503 -0.647428 -0.647427 -0.412288 -0.412289 -0.418999 -0.418999 -0.137240 -0.137239 -0.234586 -0.234586 0.274328 0.274329 0.249126 0.249126 0.234730 0.234730
chargesum: 0.00000
title: Mulliken charges with hydrogens summed into heavy atoms:
elementType: Cl Cl Cl Cl C C C C C C C C C C C C C C
charge: 0.015496 0.015497 0.052572 0.052571 0.603784 0.603785 0.420502 0.420503 -0.373099 -0.373099 -0.412288 -0.412289 -0.169873 -0.169873 -0.137240 -0.137239 0.000145 0.000144
polarizability: 3.60546986e+02 3.25780618e-06 2.18588045e+02 9.38808630e-03 4.07594549e-03 6.67609830e+01
1716.lowfreq: -3.5972 0.0004 0.0009 0.0012 5.3460 6.1016 49.3831 61.8873 86.5462
frequency: 49.3802 61.8856 86.5462 91.9704 138.8266 188.7167 202.1389 206.5631 219.1631 231.5137 287.2760 290.1385 314.0553 319.3672 341.1066 363.7570 421.8895 472.5832 514.9786 527.4253 538.6257 543.5023 605.0282 625.8897 631.2657 649.6120 731.1065 745.0736 761.6216 777.1268 797.3606 813.5795 869.7393 912.8859 912.9118 913.2544 940.3033 950.9209 974.4923 996.2265 1015.5730 1128.4174 1174.9064 1185.8447 1207.8508 1242.5629 1254.7577 1292.7131 1333.1396 1355.7285 1388.2556 1413.9599 1428.9071 1436.8005 1467.8031 1523.9934 1550.9521 1559.2310 1604.6336 1636.8949 3126.4382 3131.7729 3148.2570 3154.5711 3157.4894 3166.1543
redmass: 14.6609 7.7067 8.0521 8.8530 8.7919 8.0252 20.2786 32.4286 33.2611 4.6914 14.2832 7.4247 5.8574 23.4737 17.1803 8.0442 4.0547 2.5539 6.4178 8.8620 3.8339 9.1334 7.2259 6.9656 10.2208 7.0023 7.8411 9.4440 1.2795 3.0010 6.4381 2.6686 1.6013 5.0992 1.4561 5.8370 2.0510 10.2835 1.4024 1.3520 2.2889 1.8776 1.0885 2.5107 1.7365 2.9429 3.1015 1.6192 2.2568 4.0621 6.1144 5.6906 3.0169 6.5318 2.7874 6.4348 8.8495 6.9306 6.6920 6.6254 1.0859 1.0890 1.0956 1.0910 1.0913 1.1004
irintensity: 0.2023 0.0000 0.0000 0.1690 0.4256 0.0078 0.0653 0.0258 0.0862 0.0000 1.8751 0.1184 1.0522 2.0491 0.7224 0.0000 0.1156 21.3001 8.0606 0.0581 0.0000 29.8736 0.4232 0.0689 23.7103 0.0000 6.7557 47.5359 60.7509 0.0000 11.5962 0.0000 0.0000 1.1731 63.4858 2.2303 0.0000 3.8352 12.0101 0.0000 4.0523 31.0972 2.6309 85.0395 20.2508 30.9624 49.2140 6.1243 9.7600 12.2675 19.4758 2.5132 27.2577 2.4708 2.9823 2.5790 24.7729 5.8197 9.7197 2.1265 1.1855 0.0039 23.0911 1.3169 0.2022 39.1288
temp: 298.150 k
press: 1.00000 atm
elementType: 17 17 17 17 6 6 6 6 6 6 6 6 6 6 6 6 6 6 1 1 1 1 1 1
symmnumber: 1
zpe: 401391.5 jmol-1
zpe.correction: 0.152882 hartree
zpe.thermalcorrener: 0.167704 hartree
zpe.thermalcorrenthalpy: 0.168648 hartree
zpe.thermalcorrgfe: 0.109831 hartree
zpe.sumelectzpe: -2376.116342 hartree
zpe.sumelectthermal: -2376.101520 hartree
zpe.sumelectthermalent: -2376.100576 hartree
zpe.sumelectthermalfe: -2376.159393 hartree
dipole: 4.1616 0.0000 0.0001
dipole: 4.1616
quadrupole: -117.1345 -125.6922 -134.7831
quadrupole: 0.0000 0.0005 0.0002
quadrupole: 8.7354 0.1777 -8.9132 0.0000 0.0005 0.0002
hfenergy: -2376.269224 hartree
pointgroup: C01 [X(C14H6Cl4)]
dipole: -1.6372885 0.0000468 0.0000287 debye
dipolederiv: -0.0665869 -0.02546 0.0000014 0.1204004 -0.7082818 0.0000037 0.0000025 -0.0000167 -0.0138643 -0.0665923 0.0254229 -0.0000004 -0.1204376 -0.7082764 0.0000351 0.0000098 0.0000563 -0.013864 -0.6839141 0.232663 0.0000298 0.3837963 -0.1428166 -0.0000155 0.0000529 -0.000018 0.010561 -0.6839503 -0.2326316 0.0000442 -0.3837648 -0.1427811 0.0000247 0.0000768 0.000027 0.0105605 0.0729183 -0.0484032 0.0000035 0.1487529 -0.2554555 0.0000034 -0.0000135 -0.0000113 0.057083 0.0729122 0.048384 0.0000007 -0.1487718 -0.2554493 0.0000142 -0.0000059 0.0000285 0.057083 0.1493763 0.0391082 -0.000001 0.1010052 -0.0977303 0.000001 -0.0000005 0.0000041 0.0467506 0.149368 -0.0391221 0.0000003 -0.1010187 -0.0977222 0.0000057 0.0000009 0.0000024 0.0467505 -0.1054347 -0.0011554 0.0000005 0.0224767 0.0478046 -0.0000069 -0.0000029 -0.0000039 -0.160026 -0.1054362 0.0011639 0.0000005 -0.0224676 0.0478051 -0.0000036 -0.0000019 -0.0000056 -0.1600265 -0.0697765 0.0590573 0.0000036 -0.1620109 0.9922841 -0.0000017 0.000026 0.0000368 -0.0673802 -0.0697701 -0.0589952 0.0000074 0.1620718 0.9922776 -0.0000581 0.0000163 -0.0000978 -0.0673807 -0.1009505 -0.0012789 -0.0000008 0.1268666 0.1109386 -0.000009 -0.0000031 -0.0000039 -0.165206 -0.100957 0.0012913 -0.0000009 -0.1268546 0.1109463 -0.0000032 0.000003 -0.0000074 -0.1652061 0.7264159 -0.5179979 -0.0000347 -0.5738021 0.0540746 0.0000272 -0.0000634 0.0000112 -0.0326906 0.7264793 0.5179585 -0.0000661 0.5737633 0.0540114 -0.0000324 -0.0001001 -0.0000158 -0.0326904 0.007626 0.1429419 -0.0000037 0.1037126 0.0515863 -0.000007 -0.0000037 -0.0000075 -0.1505244 0.0076104 -0.142939 0.000002 -0.1037101 0.0516 -0.0000024 -0.0000031 -0.000002 -0.1505248 0.08753 -0.0157701 0.0000011 -0.018743 -0.0082342 0.0000048 0.0000002 0.000002 0.1557529 0.0875323 0.0157646 0.0000005 0.0187373 -0.0082358 0.0000036 0.0000001 0.0000058 0.1557528 0.0758777 0.0459477 0. -0.0517937 -0.0834985 0.0000062 0.0000013 0.0000031 0.1579817 0.075878 -0.0459571 0.0000026 0.0517847 -0.0834994 0.0000047 0. 0.0000071 0.1579815 -0.093084 -0.0908588 0.0000066 -0.0958456 0.0393316 0.0000042 0.0000056 0.000004 0.161563 -0.0930719 0.0908662 0.0000027 0.0958529 0.039321 0.0000012 0.0000026 0.0000013 0.1615634 unknown
polarizability: 360.5469859|-0.0041404|218.588045|-0.0093882|-0.0040757|66.760983 unknown
InChI: InChI=1S/C14H6Cl4/c15-11-9-5-7-3-1-2-4-8(7)6-10(9)12(16)14(18)13(11)17/h1-6H
charge 0 multiplicity 1
24 atoms
Cl 1.652621 -3.226878 0.000018
Cl 1.652808 3.226768 -0.000161
Cl 4.422337 -1.59841 -0.000141
Cl 4.422431 1.598139 -0.000234
C  0.373563 -0.731291 0.000062
C  0.373605 0.731256 0.000022
C  -2.098473 -0.728567 0.000098
C  -2.09843 0.728676 0.000061
C  -0.862488 -1.418601 0.000093
C  -0.862406 1.418638 0.000018
C  1.643378 -1.415201 0.000043
C  1.64346 1.415092 -0.000034
C  -3.359108 -1.425226 0.00013
C  -3.359025 1.425408 0.000061
C  2.849057 -0.721525 -0.000031
C  2.849099 0.721345 -0.000071
C  -4.558343 -0.719531 0.000131
C  -4.558302 0.719783 0.000097
H  -0.859717 -2.512762 0.000116
H  -0.859571 2.512799 -0.000015
H  -3.357417 -2.521355 0.00015
H  -3.35727 2.521537 0.000032
H  -5.513591 -1.255374 0.000156
H  -5.513518 1.255682 0.0001
