program: Gaussian 09
title: 000275963
version: EM64L-G09RevD.01
frameworkgroup: C1[X(C22H21ClN4O6)]
method: RPBEPBE
basis: SDD
operation: Freq
keyword: #p
keyword: freq=noraman
keyword: PBEPBE/SDD
title: #p freq=noraman PBEPBE/SDD
converged: YES YES NO NO
title: Mulliken charges:
elementType: Cl O O O O O O N N N N C C C C C C C C C C C C C C C C C C C C C C H H H H H H H H H H H H H H H H H H H H H
charge: -0.047532 -0.283779 -0.298442 -0.232144 -0.230966 -0.253398 -0.297806 -0.183011 -0.225831 -0.646996 -0.618077 -0.275337 -0.160607 0.280137 -0.414907 -0.265430 0.149459 0.257083 0.047285 -0.358395 -0.118115 -0.233502 -0.528527 0.265177 0.286155 0.227355 -0.327584 -0.315040 -0.846618 0.318156 -0.215401 -0.240907 -0.099238 0.336362 0.303578 0.256042 0.260352 0.298022 0.248767 0.265901 0.250101 0.235892 0.230060 0.278038 0.290490 0.287988 0.219149 0.223459 0.359109 0.335015 0.259992 0.261075 0.342366 0.345022
chargesum: 0.00000
title: Mulliken charges with hydrogens summed into heavy atoms:
elementType: Cl O O O O O O N N N N C C C C C C C C C C C C C C C C C C C C C C
charge: -0.047532 -0.283779 -0.298442 -0.232144 -0.230966 -0.253398 -0.297806 -0.183011 -0.225831 0.047128 0.069311 0.061025 0.142971 0.280137 0.101487 0.032592 0.149459 0.257083 0.047285 0.156272 -0.118115 -0.233502 0.187526 0.265177 0.286155 0.227355 -0.049546 -0.024549 -0.116021 0.318156 0.044592 0.020168 -0.099238
polarizability: 4.29314170e+02 1.03241533e+01 2.39423913e+02 -4.54258634e+00 -5.63701048e+01 2.63531976e+02
1716.lowfreq: -10.3270 -4.4237 -0.0021 -0.0012 -0.0007 2.9143 16.2184 27.2642 32.8359
frequency: 16.1219 27.2321 32.8024 37.3587 41.8969 57.5451 68.9342 73.0529 85.0055 92.6594 93.8699 111.0701 115.7453 128.9992 132.9205 144.4711 145.7109 156.9270 167.8420 181.7847 204.6797 209.0054 232.3761 247.5349 259.2434 273.6319 282.5565 296.4224 299.2120 317.6703 325.0805 339.5395 357.4145 384.1205 396.5144 414.5288 432.9795 444.0695 447.2936 469.9226 480.6883 490.9201 494.6645 500.0739 517.0215 528.5166 540.6211 559.3628 584.1744 596.4459 607.0711 616.2734 622.0741 664.8923 676.6068 697.7125 699.6904 704.3059 707.2389 723.1022 727.4320 743.0636 751.1306 768.8898 797.4523 816.3042 837.4038 845.8115 847.7431 858.7296 877.2435 915.7129 929.5474 938.5047 954.6278 970.3162 984.8425 988.4687 998.4210 999.7749 1003.9451 1011.7905 1028.2743 1039.6700 1050.3322 1059.1078 1071.2319 1079.3584 1090.1637 1097.4500 1103.2962 1108.2929 1113.5916 1146.9177 1150.2293 1169.7326 1181.0362 1190.3980 1193.9611 1201.9205 1206.3565 1264.7037 1272.7426 1290.9101 1301.8171 1305.5331 1308.0475 1317.7449 1325.5662 1358.1322 1372.9571 1376.5203 1379.0582 1388.1034 1398.8279 1400.5447 1417.7782 1440.6098 1451.7067 1468.2777 1473.7501 1474.5270 1477.1535 1485.0200 1491.3932 1509.0137 1543.9505 1556.4422 1575.8862 1586.7264 1587.1139 1590.6488 1596.8092 1634.9376 1679.7771 2955.6846 2982.8667 3020.8500 3024.2933 3032.2892 3034.1865 3083.7482 3093.5462 3096.4204 3098.9923 3116.1194 3135.0243 3137.1456 3152.4821 3156.0098 3171.4440 3176.8263 3459.1637 3553.5783 3661.0226 3710.9858
redmass: 8.2586 8.0057 5.9952 5.5888 7.2513 5.6779 6.4521 5.2815 5.7663 9.9714 6.2458 4.9890 3.1308 2.4238 3.2694 1.3655 2.0984 4.9864 3.1672 3.2915 6.3668 4.7143 7.9415 5.3789 5.7048 4.2212 4.9194 3.7447 6.6159 3.9722 3.5747 3.4358 4.7056 6.9396 7.4364 2.9851 4.7535 3.4823 2.5062 4.6614 3.4165 3.7143 4.8254 5.3765 1.1763 1.0835 6.6861 2.8945 5.8543 4.6697 4.4995 4.9870 7.0275 6.6635 4.9931 3.1225 2.1329 3.1611 3.3181 4.5790 5.7956 11.1895 3.9308 4.4260 5.4573 5.4439 3.1549 1.5445 1.5116 1.7988 4.8090 3.6404 4.0319 3.5659 4.3148 2.7696 1.4763 2.3135 1.8264 3.2463 2.0311 2.8740 3.2114 1.4539 2.1563 2.0197 2.8627 2.4270 3.7138 1.6883 2.5992 1.2849 1.4018 2.7523 1.6206 2.2847 2.3168 1.1898 1.3166 1.9685 1.4167 1.3268 1.6322 2.2552 1.7067 1.7383 1.4774 2.3970 2.6269 2.9530 5.9223 1.6294 3.6603 1.7831 3.6752 3.2914 1.1454 3.7697 1.1022 1.1802 1.0930 1.2046 2.3011 1.0466 1.0603 7.0531 3.2691 10.1777 4.1863 3.2573 1.2294 8.0538 5.9955 3.6287 6.6967 1.0391 1.0296 1.0624 1.0981 1.0615 1.0789 1.1037 1.0948 1.1076 1.1036 1.1033 1.0920 1.0919 1.0944 1.0888 1.0950 1.0972 1.0507 1.0447 1.0972 1.1058
irintensity: 0.2848 0.1310 0.1668 2.6546 0.3146 1.6717 1.1275 0.5179 3.5521 4.4613 12.2605 8.6722 2.8603 0.2500 3.5844 0.2095 4.1826 2.2720 4.1105 23.4795 1.3470 0.5382 6.2291 3.2885 3.4248 0.3844 0.9737 7.5618 2.0660 17.8245 6.9812 7.8021 21.0493 36.6467 5.8116 0.3660 1.9272 1.0924 41.0371 28.2058 19.9734 6.3512 17.0524 5.3607 254.9980 20.8956 7.3305 46.2301 8.1833 39.7966 20.2530 3.6211 0.5462 1.7340 12.8016 18.0111 82.5544 75.2379 19.4594 2.7348 20.3391 2.7808 14.7386 10.3106 11.5754 15.7656 32.5488 8.0485 16.6498 34.5625 9.1438 13.7902 32.3212 7.8305 55.5558 46.9040 7.7194 16.3723 15.2062 30.9680 102.6021 95.5159 6.0391 1.4255 53.5476 11.8199 33.2702 100.6868 106.6063 19.5481 40.0277 11.9821 8.5001 17.1104 19.1234 13.7726 9.6428 24.9039 3.0223 41.0785 45.5868 3.7155 31.2679 332.4016 149.7682 160.4930 2.7863 13.4703 137.3322 87.7898 11.8579 72.1881 399.0499 12.9186 59.7219 152.4674 14.8990 147.7320 18.3001 22.4072 24.1348 7.0800 39.0656 15.4997 10.6622 160.0620 363.4795 135.4306 335.2439 188.6400 85.5532 66.9801 94.7346 63.4234 342.8172 51.3708 43.5105 9.0336 26.9026 15.3062 5.8513 42.7323 1.3692 3.4741 6.7601 13.8293 8.3389 20.5773 1.6480 0.0270 1.9587 6.3048 104.4849 70.1133 66.9625 50.9064
temp: 298.150 k
press: 1.00000 atm
elementType: 17 8 8 8 8 8 8 7 7 7 7 6 6 6 6 6 6 6 6 6 6 6 6 6 6 6 6 6 6 6 6 6 6 1 1 1 1 1 1 1 1 1 1 1 1 1 1 1 1 1 1 1 1 1
symmnumber: 1
zpe: 1060854.9 jmol-1
zpe.correction: 0.404058 hartree
zpe.thermalcorrener: 0.434961 hartree
zpe.thermalcorrenthalpy: 0.435905 hartree
zpe.thermalcorrgfe: 0.340587 hartree
zpe.sumelectzpe: -1978.945641 hartree
zpe.sumelectthermal: -1978.914739 hartree
zpe.sumelectthermalent: -1978.913795 hartree
zpe.sumelectthermalfe: -1979.009112 hartree
dipole: -5.7116 0.9511 0.9697
dipole: 5.8709
quadrupole: -178.5988 -183.4539 -217.2738
quadrupole: -3.1444 -7.4837 7.7411
quadrupole: 14.5100 9.6549 -24.1649 -3.1444 -7.4837 7.7411
hfenergy: -1979.3496996 hartree
pointgroup: C01 [X(C22H21Cl1N4O6)]
dipole: 2.2549856 0.2899952 0.4074969 debye
polarizability: 427.458608|-22.6973078|203.2230212|5.2797696|-28.5575442|301.5884298 unknown
InChI: InChI=1S/C22H21ClN4O6/c1-9-15(24)18(29)14-12(8-33-21(25)31)22(32-2)19-13(7-26(22)16(14)17(9)28)27(19)20(30)10-3-5-11(23)6-4-10/h3-6,12-13,19H,7-8,24-25H2,1-2H3
charge 0 multiplicity 1
54 atoms
Cl -7.063836 0.812602 -3.481245
O  -0.444861 -1.169706 -1.44168
O  1.644962 2.422774 0.32825
O  -3.741827 -0.119775 2.453988
O  3.096066 -2.278966 2.089257
O  4.129724 0.806398 -2.381211
O  -0.353125 3.652613 0.638502
N  -1.950225 -0.42555 0.989786
N  0.95581 -0.982413 0.595259
N  6.152531 -0.522688 -1.257405
N  1.349054 3.588033 2.252376
C  -0.913058 0.476723 0.396658
C  -0.812227 -0.01816 1.847778
C  0.147565 -0.255826 -0.439013
C  0.328689 -1.043946 1.943023
C  1.204694 0.560657 -1.265902
C  2.291656 -0.921348 0.263223
C  2.503117 -0.125499 -0.857408
C  -3.305219 -0.122606 1.264715
C  1.259737 2.086253 -1.068482
C  3.386935 -1.615395 1.026454
C  3.81863 0.051535 -1.385894
C  -0.776725 -2.544468 -1.007367
C  -4.183371 0.096376 0.070552
C  4.730921 -1.479097 0.487541
C  4.934828 -0.708864 -0.662953
C  -5.522183 0.505932 0.30515
C  -3.733424 -0.098279 -1.263349
C  5.875178 -2.17771 1.190624
C  0.775587 3.269979 1.043481
C  -6.406436 0.727407 -0.768646
C  -4.61054 0.119569 -2.346667
C  -5.932137 0.530713 -2.081999
H  -1.193934 1.508979 0.165331
H  -1.031727 0.634819 2.697663
H  1.068892 -0.776296 2.713344
H  -0.049948 -2.055664 2.167121
H  0.964915 0.389645 -2.331349
H  0.296345 2.574042 -1.300437
H  2.056107 2.496166 -1.711349
H  -1.558404 -2.545006 -0.228663
H  0.125285 -3.066727 -0.640331
H  -1.144632 -3.037498 -1.920979
H  -5.851362 0.642025 1.340193
H  -2.708556 -0.429547 -1.4652
H  5.489599 -2.70364 2.078762
H  6.653824 -1.464846 1.529271
H  6.365412 -2.929333 0.539726
H  6.167647 0.092624 -2.07811
H  7.004563 -0.949042 -0.90299
H  -7.438128 1.044546 -0.592648
H  -4.273625 -0.030118 -3.376172
H  2.288687 3.268222 2.476175
H  0.841945 4.19818 2.887443
