program: Gaussian 09
title: 000275879
version: EM64L-G09RevD.01
frameworkgroup: C1[X(C14H16O3S)]
method: RPBEPBE
basis: SDD
operation: Freq
keyword: #p
keyword: freq=noraman
keyword: PBEPBE/SDD
title: #p freq=noraman PBEPBE/SDD
converged: YES YES NO NO
title: Mulliken charges:
elementType: S O O O C C C C C C C C C C C C C C H H H H H H H H H H H H H H H H
charge: 0.981619 -0.417249 -0.510244 -0.513842 -0.277466 -0.232863 -0.227034 -0.257362 -0.040131 -0.461989 -0.479400 -0.337497 -0.012254 -0.250406 -0.247793 -0.199300 -0.198950 -0.214022 0.271071 0.251960 0.253542 0.250952 0.241674 0.215639 0.214150 0.211076 0.220428 0.226989 0.239891 0.285270 0.285856 0.243955 0.244189 0.239543
chargesum: 0.00000
title: Mulliken charges with hydrogens summed into heavy atoms:
elementType: S O O O C C C C C C C C C C C C C C
charge: 0.981619 -0.417249 -0.510244 -0.513842 -0.006395 0.019097 0.026508 -0.006410 0.201543 -0.032200 -0.047896 0.129383 -0.012254 0.034864 0.038063 0.044655 0.045238 0.025522
polarizability: 2.22663798e+02 2.24764903e+01 1.58227106e+02 7.41034429e+00 -6.90895901e+00 1.58569140e+02
1716.lowfreq: -3.1709 -0.0022 -0.0020 -0.0011 5.6110 10.9795 17.0987 29.6999 36.4303
frequency: 16.3974 27.8259 35.2954 41.8944 76.4411 102.1125 141.0552 157.6681 184.8168 216.4189 246.4041 254.5790 309.4565 359.7608 362.3597 404.6331 421.4393 442.2182 459.3844 481.3738 537.3995 572.7459 602.4053 632.1164 662.5213 671.6281 687.9932 760.5055 782.3187 795.5054 797.8680 830.4769 850.8072 864.0374 885.6339 895.9352 902.1119 915.4012 931.0342 935.5441 936.5387 953.8353 972.8976 978.2962 985.0858 986.7837 1005.6817 1009.0972 1024.4546 1032.4930 1044.4409 1051.8253 1058.9918 1078.9357 1079.3344 1104.7830 1119.9109 1125.5620 1174.5256 1177.3283 1179.5026 1190.2667 1216.5189 1242.9377 1253.7681 1255.6801 1280.2217 1297.6562 1305.8295 1335.1265 1344.0473 1362.4586 1385.4361 1438.0094 1454.1403 1466.7269 1475.6279 1484.9264 1578.4009 1605.2967 2981.5611 3001.7920 3008.6827 3012.1505 3056.1027 3064.1263 3070.8493 3094.2027 3140.0069 3151.4815 3159.9554 3169.1196 3170.5418 3177.0673 3177.7488 3197.9117
redmass: 5.0978 4.0448 4.5739 5.5898 4.4784 4.7233 7.6886 6.0463 4.2178 2.8605 8.7900 8.8133 4.6304 8.8507 8.2634 2.8265 2.1156 1.9474 6.1043 3.6713 5.3443 5.7460 6.4788 4.2643 7.0323 4.0170 2.4471 1.4113 3.3010 1.9569 1.7775 14.9221 1.2424 2.3546 2.4160 2.8260 2.5066 2.2725 2.4658 2.3619 1.4544 13.6794 1.4147 6.3099 1.3918 1.3925 1.3404 4.0158 1.4706 1.6369 1.3089 2.1701 1.2131 1.5932 1.5739 2.2448 1.3044 1.4088 1.0556 1.7901 1.1539 1.1915 1.7515 1.5461 1.3588 1.9296 1.5806 1.6267 1.2953 1.4215 2.3599 1.4894 8.4628 2.2596 2.0307 1.0954 1.0825 1.0972 5.8386 6.9499 1.0553 1.0596 1.0702 1.0740 1.1077 1.1051 1.1048 1.0913 1.0860 1.0887 1.0929 1.0971 1.0918 1.0924 1.1016 1.1006
irintensity: 0.6811 0.5869 1.5072 0.4964 1.5767 0.6316 1.6781 6.2029 3.4387 1.7307 7.4606 4.3283 3.6655 3.7705 17.8504 0.0026 3.5369 13.2529 53.3607 12.7195 91.2481 86.1973 0.0009 3.0169 10.0877 0.8786 37.2679 67.5914 4.9555 31.3479 23.9808 85.6724 0.2979 4.3369 11.2344 34.9775 6.1226 38.6136 8.9843 1.8652 7.8698 84.0808 2.0974 2.1097 0.0812 0.8954 0.1475 1.2244 1.4368 7.8430 1.3859 21.8276 0.5472 1.0615 2.6899 1.9626 0.4353 0.1908 0.0078 24.0493 2.1256 3.5687 10.1907 5.1223 0.7091 6.2079 3.4039 5.6330 3.3197 7.2320 1.9842 0.5662 6.2261 16.7285 13.8419 8.1232 26.2301 7.7963 1.9694 0.2710 31.4389 51.7758 51.9713 12.5108 19.3822 36.9054 41.8585 40.4363 1.3003 10.8174 1.6094 2.3430 8.8743 10.3332 24.7983 17.8244
temp: 298.150 k
press: 1.00000 atm
elementType: 16 8 8 8 6 6 6 6 6 6 6 6 6 6 6 6 6 6 1 1 1 1 1 1 1 1 1 1 1 1 1 1 1 1
symmnumber: 1
zpe: 705451.0 jmol-1
zpe.correction: 0.268692 hartree
zpe.thermalcorrener: 0.285114 hartree
zpe.thermalcorrenthalpy: 0.286058 hartree
zpe.thermalcorrgfe: 0.221613 hartree
zpe.sumelectzpe: -1165.272400 hartree
zpe.sumelectthermal: -1165.255978 hartree
zpe.sumelectthermalent: -1165.255034 hartree
zpe.sumelectthermalfe: -1165.319479 hartree
dipole: -0.5816 -4.3736 -1.0001
dipole: 4.5240
quadrupole: -90.7555 -119.8124 -111.9434
quadrupole: 15.5156 2.0419 -4.1658
quadrupole: 16.7482 -12.3086 -4.4396 15.5156 2.0419 -4.1658
hfenergy: -1165.5410922 hartree
pointgroup: C01 [X(C14H16O3S1)]
dipole: -0.2678261 -1.6976559 -0.4628303 debye
polarizability: 223.6333112|20.6454335|157.7698051|8.3072058|-7.0422414|158.0569268 unknown
InChI: InChI=1S/C14H16O3S/c15-18(16,10-4-2-1-3-5-10)17-8-13-9-6-11-12(7-9)14(11)13/h1-5,9,11-14H,6-8H2
charge 0 multiplicity 1
34 atoms
S  -1.393325 1.527313 0.290332
O  0.001276 0.448768 -0.319266
O  -1.59702 2.759848 -0.742988
O  -1.169117 1.81854 1.870695
C  2.547748 -1.163073 0.268511
C  3.961053 -1.707507 -0.040974
C  3.737561 -0.800323 1.1944
C  3.825203 0.516406 -0.720393
C  2.329176 0.034231 -0.672067
C  4.544316 -0.80582 -1.144254
C  4.213941 0.605736 0.790918
C  1.337188 1.088698 -0.168717
C  -2.754263 0.255942 0.052296
C  -3.047111 -0.596503 1.128244
C  -3.42582 0.237964 -1.180093
C  -4.0881 -1.535998 0.946531
C  -4.462861 -0.71013 -1.339575
C  -4.787479 -1.593202 -0.282538
H  1.725584 -1.802083 0.591421
H  4.21021 -2.765834 0.050613
H  3.810777 -1.179136 2.214909
H  4.029324 1.403916 -1.337096
H  2.002248 -0.293542 -1.677855
H  4.262263 -1.134015 -2.161407
H  5.645027 -0.717964 -1.090642
H  5.303576 0.737022 0.92316
H  3.699086 1.417735 1.333965
H  1.378382 2.005332 -0.78905
H  1.503727 1.33862 0.895127
H  -2.49615 -0.51555 2.07046
H  -3.159002 0.944965 -1.971774
H  -4.349653 -2.218203 1.761721
H  -5.012596 -0.756359 -2.285099
H  -5.592672 -2.323892 -0.41471
