program: Gaussian 09
title: 000275852
version: EM64L-G09RevD.01
frameworkgroup: C1[X(C11H9Br)]
method: RPBEPBE
basis: SDD
operation: Freq
keyword: #pfreq=noraman
keyword: PBEPBE/SDD
title: #p freq=noraman PBEPBE/SDD
converged: YES YES NO NO
title: Mulliken charges:
elementType: Br C C C C C C C C C C C H H H H H H H H H
charge: -0.026551 -0.388957 -0.388957 -0.486870 0.356293 0.356293 -0.178110 -0.178111 -0.459719 -0.459719 -0.226741 -0.226742 0.277102 0.277101 0.314527 0.244593 0.244594 0.247385 0.247385 0.227601 0.227601
chargesum: 0.00000
title: Mulliken charges with hydrogens summed into heavy atoms:
elementType: Br C C C C C C C C C C C
charge: -0.026551 -0.111856 -0.111855 -0.172343 0.356293 0.356293 0.066483 0.066483 -0.212334 -0.212334 0.000860 0.000859
polarizability: 1.81239257e+02 1.41834645e-03 1.13744166e+02 1.31530258e+01 -1.03937626e-03 7.81682729e+01
1716.lowfreq: -4.7728 0.0000 0.0004 0.0007 7.9311 13.4857 87.1362 131.4074 180.8116
frequency: 87.1362 131.4070 180.8085 196.7872 254.7623 352.6229 366.7725 447.0202 466.0304 546.4054 555.3744 614.3886 695.8511 714.8131 749.3419 761.0334 776.6333 785.9377 824.1151 850.8249 876.2928 895.2083 895.3444 920.0308 945.0493 953.1125 986.9302 990.8975 1013.4726 1073.5746 1079.3502 1130.3402 1140.7645 1158.1512 1168.5512 1185.3900 1187.9252 1223.0254 1236.6296 1238.4738 1287.4397 1295.9930 1396.7732 1445.0298 1445.3016 1585.4012 1600.2144 1614.4998 3097.7364 3116.2977 3122.3843 3125.1606 3133.7809 3145.5659 3162.6332 3181.3470 3213.1345
redmass: 6.1637 5.4479 5.9361 3.6176 7.4454 3.6824 3.1732 3.7469 3.6860 3.2890 3.7007 4.8273 2.2791 2.8441 5.4825 3.2808 1.6006 4.3402 3.0188 2.9547 1.7279 1.6189 2.7938 1.7873 1.7865 2.1451 1.3748 2.1943 2.3002 1.2121 2.2048 1.8032 1.6147 1.6307 1.1428 1.4679 1.7505 1.3255 1.3545 1.3043 1.5411 1.4915 6.6457 2.3600 2.4741 5.9671 6.7705 7.4479 1.0878 1.0895 1.0939 1.0853 1.0899 1.0950 1.1003 1.0879 1.1107
irintensity: 0.1191 0.1937 3.1487 0.0016 3.4291 0.9330 0.2104 0.3223 13.3015 5.5889 0.0908 0.8592 71.3307 159.5677 0.2636 11.4306 61.7360 0.8396 3.2482 1.8487 2.8049 0.6152 9.4493 0.5182 1.4791 1.5754 0.0069 0.1990 3.5205 0.1961 0.3194 0.7173 4.0169 4.4078 3.0150 3.5317 2.5974 63.6646 20.6071 0.0156 11.5807 2.5238 5.6933 6.7314 14.5704 0.9774 0.5738 0.0018 10.5339 25.6762 4.4175 0.9882 3.0619 31.0785 34.6516 2.6133 12.3694
temp: 298.150 k
press: 1.00000 atm
elementType: 35 6 6 6 6 6 6 6 6 6 6 6 1 1 1 1 1 1 1 1 1
symmnumber: 1
zpe: 428414.3 jmol-1
zpe.correction: 0.163174 hartree
zpe.thermalcorrener: 0.172229 hartree
zpe.thermalcorrenthalpy: 0.173173 hartree
zpe.thermalcorrgfe: 0.127884 hartree
zpe.sumelectzpe: -437.154344 hartree
zpe.sumelectthermal: -437.145289 hartree
zpe.sumelectthermalent: -437.144345 hartree
zpe.sumelectthermalfe: -437.189634 hartree
dipole: -2.6808 0.0000 0.3719
dipole: 2.7065
quadrupole: -81.4871 -70.8907 -79.7269
quadrupole: 0.0000 3.2877 0.0000
quadrupole: -4.1189 6.4775 -2.3586 0.0000 3.2877 0.0000
hfenergy: -437.3175182 hartree
pointgroup: C01 [X(C11H9Br1)]
dipole: -1.0152983 0.0000149 -0.3209825 debye
dipolederiv: -0.9160419 0.0000139 -0.2044906 0.0000321 -0.1524238 0.0000159 -0.1428393 -0.0000143 -0.1560827 -0.1979991 0.1012534 -0.0144117 -0.0268396 0.1905643 0.018718 0.1245134 0.0646833 0.003608 -0.1980051 -0.1012518 -0.0144155 0.0268195 0.1905799 -0.0187221 0.1245158 -0.064675 0.0036238 1.4674627 -0.0000219 0.3837153 -0.0000725 -0.033189 -0.0000469 0.2425341 0.0000109 0.1999227 0.096964 0.0246092 -0.0428109 0.3169814 -0.1144914 -0.036662 -0.1354587 -0.0357197 -0.0970413 0.0969495 -0.0246127 -0.042834 -0.3169694 -0.114488 0.0366727 -0.1355105 0.0357281 -0.0970543 -0.2535293 -0.052424 -0.1254057 -0.0484209 -0.0298795 0.063849 -0.0942848 -0.0484866 0.0813119 -0.2535303 0.0524371 -0.1254058 0.0483314 -0.0298761 -0.0638847 -0.0943397 0.0484688 0.0812801 -0.0376357 -0.0124956 0.0070401 -0.0967195 0.1347637 0.0032638 -0.0301293 -0.0007012 -0.1642233 -0.0375645 0.0124954 0.0070721 0.096631 0.1347624 -0.0033104 -0.0301127 0.0007162 -0.1642181 -0.0111438 -0.0503328 -0.00683 -0.1341007 -0.018118 -0.0042363 -0.0038457 -0.0003021 -0.148684 -0.0111709 0.0503322 -0.0068288 0.1341481 -0.0181236 0.0042753 -0.0038342 0.0003091 -0.1486833 0.046114 -0.0227285 0.002334 -0.0306933 -0.0930443 -0.0417691 -0.0125418 -0.0586233 0.0558959 0.0461088 0.0227316 0.0023305 0.030747 -0.0930538 0.0417894 -0.0125446 0.058619 0.0559008 -0.1125522 -0.0000025 0.0453473 0.0000061 0.0837793 0.0000098 0.0004061 -0.0000008 -0.0795329 0.1577536 -0.0124542 0.0603455 -0.0179114 0.0445425 0.0751163 0.0820781 0.0686861 -0.0230002 0.1577336 0.0124499 0.0603422 0.0179884 0.0445534 -0.0750831 0.0821458 -0.0686764 -0.0229962 0.0846543 -0.0215862 -0.0000671 0.0231672 -0.1011245 -0.0019766 0.0039538 -0.0001544 0.1486488 0.0846665 0.021585 -0.0000585 -0.0231187 -0.1011229 0.0019972 0.0039369 0.000139 0.1486404 -0.104606 0.091347 0.0075275 0.0918294 0.0376941 -0.0025681 0.015688 -0.0039126 0.1613448 -0.1046283 -0.0913445 0.0075042 -0.0918357 0.0376952 0.0025521 0.0156692 0.003906 0.1613393 unknown
polarizability: 182.6910451|-0.0016554|113.7441657|4.6105453|0.0001317|76.7164844 unknown
InChI: InChI=1S/C11H9Br/c12-11-9-5-6-10(11)8-4-2-1-3-7(8)9/h1-6,9-11H
charge 0 multiplicity 1
21 atoms
Br 3.558845 -0.000052 1.210324
C  1.00495 1.151268 -0.00136
C  1.004942 -1.151262 -0.001446
C  1.547637 -0.000033 0.921168
C  -0.478728 0.713609 0.055824
C  -0.478734 -0.713596 0.05577
C  1.548343 0.680192 -1.372203
C  1.548338 -0.680089 -1.372254
C  -1.677972 1.436915 0.10603
C  -1.677983 -1.436896 0.105923
C  -2.898659 0.707175 0.140802
C  -2.898665 -0.70715 0.140749
H  1.226763 2.184172 0.296169
H  1.226747 -2.18419 0.296007
H  1.136408 -0.00007 1.942491
H  1.820345 1.355393 -2.185273
H  1.820336 -1.355231 -2.185373
H  -1.684231 2.532428 0.117434
H  -1.68425 -2.53241 0.117245
H  -3.851861 1.247031 0.169283
H  -3.85187 -1.247001 0.16919
