program: Gaussian 09
title: 000275851
version: EM64L-G09RevD.01
frameworkgroup: C1[X(C10H8O3)]
method: RPBEPBE
basis: SDD
operation: Freq
keyword: #pfreq=noraman
keyword: PBEPBE/SDD
title: #p freq=noraman PBEPBE/SDD
converged: NO NO NO NO
title: Mulliken charges:
elementType: O O O C C C C C C C C C C H H H H H H H H
charge: -0.234912 -0.155519 -0.155524 -0.387441 -0.387442 -0.439178 -0.439178 0.186883 0.186877 -0.190007 -0.190009 0.093119 0.093124 0.271580 0.271579 0.244957 0.245530 0.245529 0.244958 0.247538 0.247538
chargesum: 0.00000
title: Mulliken charges with hydrogens summed into heavy atoms:
elementType: O O O C C C C C C C C C C
charge: -0.234912 -0.155519 -0.155524 -0.115862 -0.115862 0.051308 0.051308 0.186883 0.186877 0.057531 0.057529 0.093119 0.093124
polarizability: 1.09577744e+02 -1.04745934e-04 1.28942445e+02 -2.62326630e+00 -6.84458927e-05 7.51513783e+01
1716.lowfreq: -9.5226 -4.1803 -0.0010 -0.0008 -0.0007 15.8267 97.4660 98.7132 173.5942
frequency: 97.4641 98.7050 173.5939 197.8500 227.3846 283.3209 370.3563 419.8084 457.9384 474.3583 514.6090 552.8886 597.7642 637.6586 641.3419 679.4289 699.1765 713.6378 733.7852 768.7814 807.6552 809.0099 834.4232 852.4769 916.4524 929.7924 947.4048 988.0703 999.6942 1021.2369 1080.5343 1112.2570 1142.8434 1150.0191 1199.5862 1219.2040 1219.8688 1225.0923 1282.6487 1292.1139 1314.3666 1332.8363 1376.0507 1464.9140 1478.6579 1597.9132 1647.9338 1679.0425 1732.0780 3011.9303 3025.8160 3071.8958 3093.6824 3094.5369 3097.5519 3153.0041 3183.7577
redmass: 5.4785 5.5763 13.8611 2.6226 3.0820 5.3418 3.8186 4.2193 4.8495 8.8649 6.0897 4.3513 13.3641 8.9792 5.7107 3.5271 3.1890 9.5212 2.9390 8.2064 2.1105 5.5581 1.7658 2.9183 3.0867 1.4501 1.9296 4.2748 6.0251 2.4938 3.7814 1.0512 1.0589 1.0925 1.3567 1.1772 2.4720 1.5712 1.2889 1.8257 1.6534 1.9597 3.1759 1.0798 1.0924 5.9031 8.5265 13.1075 12.9699 1.0583 1.0614 1.1055 1.1063 1.0882 1.0896 1.0868 1.1062
irintensity: 1.7006 0.0264 1.2922 1.1871 0.7179 5.2960 0.5289 4.0954 3.6457 0.5761 4.3364 13.5295 2.3140 13.2630 0.2227 6.9499 42.6976 130.8929 31.1040 0.0031 6.5927 0.0162 33.0380 0.9172 2.8566 0.1087 0.7789 9.6678 101.7449 0.1741 1.3587 0.1062 21.0941 4.3675 4.3245 3.6986 67.1240 3.1279 0.3592 4.4393 18.4536 2.9099 0.3182 5.5124 4.0231 31.2154 20.2805 511.2597 110.3279 21.6002 38.4150 0.0429 29.4405 23.8268 2.8816 1.9130 13.9229
temp: 298.150 k
press: 1.00000 atm
elementType: 8 8 8 6 6 6 6 6 6 6 6 6 6 1 1 1 1 1 1 1 1
symmnumber: 1
zpe: 411074.0 jmol-1
zpe.correction: 0.156570 hartree
zpe.thermalcorrener: 0.166276 hartree
zpe.thermalcorrenthalpy: 0.167220 hartree
zpe.thermalcorrgfe: 0.121488 hartree
zpe.sumelectzpe: -610.578396 hartree
zpe.sumelectthermal: -610.568690 hartree
zpe.sumelectthermalent: -610.567746 hartree
zpe.sumelectthermalfe: -610.613479 hartree
dipole: 6.9491 0.0000 0.3595
dipole: 6.9584
quadrupole: -84.2957 -81.1912 -70.3098
quadrupole: -0.0001 -0.5331 0.0001
quadrupole: -5.6968 -2.5923 8.2891 -0.0001 -0.5331 0.0001
hfenergy: -610.7349662 hartree
pointgroup: C01 [X(C10H8O3)]
dipole: -2.7323552 0.0000601 -0.1700844 debye
dipolederiv: -0.8430649 -0.0000078 0.0021164 0.0000035 -1.1863835 0.0001649 0.002253 0.000187 -0.2162718 -0.5556438 -0.2918604 -0.0009766 -0.2202412 -1.0181236 0.0015853 0.0082336 0.0167376 -0.2980446 -0.555614 0.2918256 -0.001089 0.2202133 -1.0181435 -0.0013132 0.0081669 -0.016514 -0.2980422 -0.1382085 0.0730816 0.0245898 -0.1203326 0.2446084 -0.0167837 0.0113698 0.052896 -0.0517243 -0.138205 -0.0730497 0.0246241 0.1203585 0.2445957 0.0166803 0.0113467 -0.0529878 -0.0517157 0.1021412 -0.0230263 0.000411 0.0997347 -0.0530662 0.0542107 0.0788418 -0.0575094 0.1304682 0.1021277 0.0230198 0.0004 -0.0997135 -0.0530616 -0.0541481 0.0788718 0.057565 0.1304619 -0.0677892 -0.3444975 0.0138053 -0.6150787 -0.167198 -0.0116385 -0.0088704 0.0120523 -0.0698421 -0.0677186 0.3444921 0.0136863 0.6150637 -0.1672209 0.0116709 -0.0090995 -0.0120127 -0.0698309 -0.1083157 -0.0021782 -0.1977738 0.1433997 -0.0640823 -0.1244442 -0.2026646 -0.0013744 0.0267048 -0.1083173 0.0021084 -0.19777 -0.1434684 -0.0640321 0.1244853 -0.2026284 0.001412 0.0266646 1.1336187 0.2263097 -0.0002412 0.2217115 1.615259 -0.006876 -0.006625 -0.0177203 0.3045285 1.1335682 -0.2262692 -0.0001482 -0.2216878 1.6152651 0.0064015 -0.0065519 0.0172624 0.3045205 0.0579932 -0.0275921 0.0012797 0.0171704 -0.0893916 -0.0114554 -0.002363 -0.0163262 0.0666128 0.0579944 0.0275853 0.0012691 -0.017179 -0.0893824 0.0115089 -0.0023615 0.016378 0.0666025 0.0391257 -0.0554709 0.0797125 -0.0172509 0.0330138 0.0419969 0.0470296 0.080397 -0.0950103 -0.1190915 0.0977233 -0.0399409 0.0393232 0.0395881 0.0094249 -0.0458091 0.004344 0.0589722 -0.1190943 -0.0977309 -0.0399114 -0.0393338 0.0395885 -0.009419 -0.0457999 -0.004337 0.0589774 0.0391263 0.0554982 0.0796944 0.0172669 0.0329702 -0.04204 0.0470247 -0.0804386 -0.0949648 0.0776875 0.0397129 0.1181225 0.0311623 0.0525792 -0.0528537 0.1198118 -0.0522446 0.0354848 0.0776798 -0.0396739 0.1181402 -0.031122 0.052618 0.0528422 0.1198234 0.0522337 0.0354483 unknown
polarizability: 109.6289422|0.0002322|128.9424439|-2.2619292|-0.0092255|75.1001813 unknown
InChI: InChI=1S/C10H8O3/c11-9-7-5-1-2-6(4-3-5)8(7)10(12)13-9/h1-2,5-6H,3-4H2
charge 0 multiplicity 1
21 atoms
O  2.456827 -0.000087 -0.011817
O  2.054408 2.330519 -0.017011
O  2.054286 -2.330668 -0.016216
C  -1.164165 1.323374 0.052297
C  -1.16423 -1.323335 0.052747
C  -1.866026 0.781526 -1.27687
C  -1.86605 -0.781903 -1.276613
C  0.196203 0.683365 0.04382
C  0.19617 -0.683397 0.044064
C  -1.959389 0.679982 1.202197
C  -1.959425 -0.679511 1.202426
C  1.591238 1.183372 0.004012
C  1.591186 -1.183485 0.004468
H  -1.145834 2.422277 0.085668
H  -1.145953 -2.422228 0.086494
H  -1.328039 1.177922 -2.155666
H  -2.895916 1.175807 -1.301472
H  -2.895952 -1.176161 -1.301101
H  -1.328059 -1.178607 -2.155268
H  -2.503007 1.303494 1.91755
H  -2.503072 -1.302754 1.917992
