program: Gaussian 09
title: 000275847
version: EM64L-G09RevD.01
frameworkgroup: C1[X(C9H7Br2ClO2)]
method: RPBEPBE
basis: SDD
operation: Freq
keyword: #p
keyword: freq=noraman
keyword: PBEPBE/SDD
title: #p freq=noraman PBEPBE/SDD
converged: YES YES NO NO
title: Mulliken charges:
elementType: Br Br Cl O O C C C C C C C C C H H H H H H H
charge: 0.003056 0.063668 -0.039223 -0.391978 -0.194936 -0.651482 0.612531 -0.543685 -0.386146 -0.299748 -0.205101 -0.216093 0.261562 -0.108715 0.352750 0.349844 0.243129 0.235823 0.261723 0.260241 0.392782
chargesum: 0.00000
title: Mulliken charges with hydrogens summed into heavy atoms:
elementType: Br Br Cl O O C C C C C C C C C
charge: 0.003056 0.063668 -0.039223 0.000803 -0.194936 -0.298732 0.612531 -0.193842 -0.143017 -0.063926 0.056622 0.044148 0.261562 -0.108715
polarizability: 2.03046507e+02 2.37602418e+01 1.40954733e+02 -2.72020384e+00 6.50890985e-01 1.11045358e+02
1716.lowfreq: -4.4354 -0.0025 -0.0021 -0.0021 3.6664 8.0816 30.1437 35.8810 49.2494
frequency: 30.1230 35.8781 49.2467 65.7456 93.7342 119.1943 125.5580 145.0134 172.0528 207.7077 242.3968 305.8834 319.6991 407.5120 407.7337 460.2530 499.7921 512.7059 573.6122 589.0155 626.8775 636.9559 668.3577 719.7746 725.6369 818.5034 826.2055 835.4146 901.4514 955.0101 966.6085 1000.5581 1042.1450 1074.5948 1079.4907 1116.9532 1141.1323 1168.6411 1189.8735 1222.7744 1230.1770 1294.8950 1312.5337 1366.8304 1392.5448 1416.4209 1481.9083 1584.8507 1599.9712 1663.2858 3100.0853 3130.5806 3139.1057 3144.0152 3173.6571 3176.4987 3518.8733
redmass: 7.3205 10.1149 7.1413 9.5173 15.2310 9.4423 11.2777 11.0212 28.1006 11.6073 8.7216 6.2983 5.9956 3.0622 7.5945 4.4173 3.4509 3.6372 4.9410 3.3724 5.9311 1.6525 6.2022 5.5558 3.6698 4.5761 1.3245 1.6001 4.6805 1.3736 1.3822 4.0878 3.2931 2.8024 2.1690 1.4065 1.0870 1.2729 1.1210 1.3296 2.0559 1.4346 1.9151 2.9990 4.0901 1.9633 2.4920 7.1922 6.1601 9.1965 1.0873 1.0877 1.0902 1.0893 1.0955 1.0966 1.0642
irintensity: 0.0045 0.2754 0.3895 2.5318 0.7622 2.0984 0.6603 2.8612 1.3808 1.1219 1.9229 3.9408 5.6908 5.2927 42.8036 11.7061 14.0113 15.4826 34.9211 149.1298 11.4050 125.1049 12.8420 0.6015 12.9886 51.8440 2.8486 39.6463 3.1187 0.6285 0.1399 28.6189 258.5395 29.1042 42.4706 5.0055 20.3295 12.1207 2.4959 28.6908 37.6162 2.4324 15.5223 45.6829 13.6662 22.2421 35.9530 1.2405 65.6552 208.1804 0.5781 0.6043 4.9712 7.0239 4.0531 0.1942 49.0021
temp: 298.150 k
press: 1.00000 atm
elementType: 35 35 17 8 8 6 6 6 6 6 6 6 6 6 1 1 1 1 1 1 1
symmnumber: 1
zpe: 363700.9 jmol-1
zpe.correction: 0.138526 hartree
zpe.thermalcorrener: 0.152890 hartree
zpe.thermalcorrenthalpy: 0.153835 hartree
zpe.thermalcorrgfe: 0.093146 hartree
zpe.sumelectzpe: -983.573546 hartree
zpe.sumelectthermal: -983.559182 hartree
zpe.sumelectthermalent: -983.558238 hartree
zpe.sumelectthermalfe: -983.618926 hartree
dipole: 0.5835 -0.4121 -0.9004
dipole: 1.1493
quadrupole: -104.7892 -113.8880 -102.1658
quadrupole: -1.2414 -7.3277 0.5851
quadrupole: 2.1585 -6.9404 4.7819 -1.2414 -7.3277 0.5851
hfenergy: -983.7120723 hartree
pointgroup: C01 [X(C9H7Br2Cl1O2)]
dipole: 0.2382247 -0.2829947 -0.2600379 debye
dipolederiv: -0.4668573 -0.042011 0.0386802 -0.3468576 -0.678734 0.2933626 0.3590809 0.3453223 -0.2848377 -0.2040043 -0.037576 0.0119395 0.0471268 -0.5462261 0.2249513 -0.0141669 0.2428944 -0.1773571 -0.9374391 -0.1645557 -0.0011272 -0.1675022 -0.1076646 -0.027025 -0.0222716 -0.03148 -0.1010714 -0.8467688 0.2684301 0.4746144 0.2658046 -0.4646548 -0.1705364 0.4395115 -0.1698764 -0.6774201 -0.7234668 -0.1352038 -0.1421183 0.0311663 -0.5082781 -0.2598867 0.0123104 -0.2958161 -0.6489979 0.9314249 0.1705064 -0.101126 0.4134613 0.648092 -0.3613304 -0.3612376 -0.3397829 0.2975271 -0.3864167 -0.0821201 0.0238419 0.0593254 -0.1043995 0.0292874 -0.0565658 0.0022785 -0.071215 -0.1678858 -0.1095142 0.0537896 -0.2325058 0.6408849 -0.3727425 0.045804 -0.3597 0.2074905 0.128907 0.092539 0.0484086 -0.0690306 -0.071902 0.1130858 -0.1173309 0.0640512 0.0331416 0.1125584 -0.0003226 -0.0762122 0.0924939 -0.0167064 0.0364704 0.0661862 0.1024921 -0.0064416 -0.379357 -0.1218251 -0.1098985 -0.1425524 -0.1112307 0.0085749 -0.1710283 -0.0133542 -0.0301624 -0.4544709 -0.0254081 0.0990203 0.0362272 -0.0501386 0.0497931 0.1321193 0.0722867 -0.0355049 1.4632963 0.0796598 -0.2947065 -0.055965 0.6231327 0.5209729 -0.2966153 0.5946028 0.957154 1.3580408 0.2584557 0.0005441 0.253684 0.0494285 0.110559 0.017468 0.1010162 0.1094283 0.0887149 -0.0100471 0.0212114 -0.0292426 -0.0032202 0.0627057 0.0234757 0.0058237 -0.0195862 0.0947849 -0.0319224 -0.0161761 -0.0017578 -0.0128553 0.0615621 -0.0306681 0.0104499 -0.0129408 0.0432998 -0.0565341 -0.0677319 -0.0520899 0.0726777 -0.0762505 -0.042163 -0.0743299 0.0257385 0.0150564 0.0335842 0.0942372 0.0219135 0.0863008 -0.0450995 0.1030394 -0.0540752 0.0353354 0.030178 0.0208731 0.0665943 0.0202654 0.1299005 -0.0573699 0.0623739 -0.0589287 0.0548027 0.0638535 -0.0386045 -0.0360161 -0.0421546 0.1013707 -0.0774511 -0.0362385 -0.0771461 0.0459373 0.2365518 -0.0684036 -0.0877687 -0.1018099 0.3242224 -0.0636332 -0.1130832 -0.0667282 0.2989798 unknown
polarizability: 201.2591422|22.9335946|138.1423542|-12.345254|-11.2446606|115.6451017 unknown
InChI: InChI=1S/C9H7Br2ClO2/c10-7(8(11)9(13)14)5-1-3-6(12)4-2-5/h1-4,7-8,13H
charge 0 multiplicity 1
21 atoms
Br 1.345541 2.20409 -1.181436
Br 1.538064 -2.102502 0.938302
Cl -5.125775 -0.525711 -0.097868
O  4.182811 -0.614345 -0.870617
O  3.710955 0.651044 1.029304
C  0.889149 0.65058 0.157843
C  -0.576194 0.343317 0.066576
C  1.882711 -0.441945 -0.225507
C  -1.443449 0.85057 1.067612
C  -1.125719 -0.425938 -0.992718
C  -2.829736 0.59099 1.028541
C  -2.507281 -0.694484 -1.047535
C  3.328039 -0.053172 0.073985
C  -3.340706 -0.181066 -0.03219
H  1.173791 1.097623 1.122621
H  1.778394 -0.808395 -1.255202
H  -1.034491 1.450226 1.888826
H  -0.481665 -0.81535 -1.788623
H  -3.495021 0.979061 1.804622
H  -2.930842 -1.288551 -1.862005
H  5.126221 -0.380842 -0.653934
