program: Gaussian 09
title: 000275844
version: EM64L-G09RevD.01
frameworkgroup: C1[X(C6H10BrNO3)]
method: RPBEPBE
basis: SDD
operation: Freq
keyword: #p
keyword: freq=noraman
keyword: PBEPBE/SDD
title: #p freq=noraman PBEPBE/SDD
converged: NO YES NO NO
title: Mulliken charges:
elementType: Br O O O N C C C C C C H H H H H H H H H H
charge: -0.008004 -0.193052 -0.149168 -0.126537 0.212598 0.016816 -0.536840 -0.423998 -0.344295 -0.392917 -0.402490 0.280374 0.300498 0.221280 0.228420 0.229304 0.237660 0.220051 0.205550 0.220821 0.203929
chargesum: 0.00000
title: Mulliken charges with hydrogens summed into heavy atoms:
elementType: Br O O O N C C C C C C
charge: -0.008004 -0.193052 -0.149168 -0.126537 0.212598 0.297190 -0.236342 0.025702 0.122669 0.032685 0.022259
polarizability: 1.27437032e+02 -9.64400593e+00 9.90202662e+01 -1.91125841e-01 2.90363639e+00 7.77519053e+01
1716.lowfreq: -10.6427 0.0001 0.0002 0.0005 5.4250 6.3453 15.5343 56.5879 68.4922
frequency: 10.9379 56.5175 68.3914 129.7343 161.2385 201.0521 232.0010 307.8574 318.5873 358.2827 385.1141 432.8182 479.1377 567.6194 616.4495 625.5714 671.2312 745.5608 795.6329 840.5201 856.8406 896.6377 914.9919 939.2433 975.3588 1046.5298 1059.7500 1094.8546 1105.3825 1123.1660 1169.5144 1182.2677 1209.2760 1239.2276 1255.0917 1282.8385 1296.8729 1322.0127 1325.7038 1334.5531 1339.5164 1349.0597 1463.2893 1465.8337 1470.7840 1476.8959 1531.6271 2981.2178 2983.2197 2997.4305 3002.0070 3036.0700 3047.4380 3052.0656 3061.6734 3067.9920 3081.0227
redmass: 12.7807 7.7244 4.4081 3.7211 6.0088 6.2612 3.7065 1.7530 6.0686 3.7587 4.8596 3.1181 2.2977 5.1034 5.9665 13.7355 3.0561 13.9548 1.7239 2.0624 1.7052 2.3219 2.8536 2.3225 2.5804 1.4687 1.6520 2.1730 2.1969 1.7680 8.7335 1.3591 1.5070 1.2980 1.2961 1.2746 1.1982 1.3547 1.3015 1.3877 1.4332 1.4458 1.0895 1.0891 1.0814 1.0927 13.7510 1.0669 1.0605 1.0618 1.0628 1.0845 1.0960 1.0999 1.0931 1.1020 1.0967
irintensity: 0.0835 0.0481 0.0347 0.3645 0.5374 0.7286 3.0362 0.2004 2.3481 3.8421 5.8412 0.7093 3.2373 26.1668 22.4074 2.5508 27.1497 251.9801 1.8374 17.0933 24.1684 2.2087 43.4534 0.8561 46.5814 3.7762 1.0515 6.8900 1.9978 3.1612 220.6191 23.1304 4.6701 2.2922 8.5658 2.2781 7.7312 1.3606 7.8843 0.3896 0.2217 0.1926 7.6760 8.7223 21.2533 6.0639 231.5520 26.1910 35.0640 17.6882 9.0458 13.2903 41.6029 42.4952 12.4124 9.9815 35.0229
temp: 298.150 k
press: 1.00000 atm
elementType: 35 8 8 8 7 6 6 6 6 6 6 1 1 1 1 1 1 1 1 1 1
symmnumber: 1
zpe: 424922.6 jmol-1
zpe.correction: 0.161844 hartree
zpe.thermalcorrener: 0.173005 hartree
zpe.thermalcorrenthalpy: 0.173949 hartree
zpe.thermalcorrgfe: 0.121689 hartree
zpe.sumelectzpe: -527.538014 hartree
zpe.sumelectthermal: -527.526854 hartree
zpe.sumelectthermalent: -527.525910 hartree
zpe.sumelectthermalfe: -527.578170 hartree
dipole: 5.2160 -1.6254 0.2264
dipole: 5.4681
quadrupole: -76.4448 -74.8683 -76.4218
quadrupole: -4.3225 -1.5470 -0.5938
quadrupole: -0.5331 1.0433 -0.5102 -4.3225 -1.5470 -0.5938
hfenergy: -527.6998588 hartree
pointgroup: C01 [X(C6H10Br1N1O3)]
dipole: 1.620046 1.4154736 0.0064544 debye
dipolederiv: -0.191732 -0.1218743 -0.0078072 -0.0895169 -0.6643965 -0.0166303 -0.0294691 -0.1034891 -0.1324483 -1.2794858 -0.2363578 -0.2496746 -0.3309243 -0.3052224 -0.0845259 -0.3717776 -0.0618852 -0.3742777 -0.4820871 -0.0827153 0.0102124 -0.1019091 -0.1407418 0.0312417 -0.1789552 -0.0089544 -0.8506739 -1.031745 -0.2210241 0.1639125 -0.2768712 -0.1754395 0.0517134 0.2390793 0.0668989 -0.4280886 2.1274934 0.479838 0.0731208 0.633998 0.2729335 0.0125954 0.4680138 0.0582491 1.4355091 0.6836475 -0.0602134 0.0587929 0.1089216 0.1040483 -0.0011455 -0.253327 -0.16297 0.0226309 0.0820932 0.1892237 0.0234498 0.0470005 0.8941044 0.0775094 0.1021746 0.1594298 0.167045 -0.1278943 0.1196612 0.0174904 0.0072163 0.0522429 0.0048258 0.0665595 0.0966029 0.1548196 0.0161764 -0.0108094 0.0251885 -0.0237399 -0.1693425 0.0033904 -0.1003184 -0.081793 0.0988676 0.0941369 0.0316957 0.0012318 -0.0557406 0.0320353 0.0151185 -0.0541158 -0.0503763 0.1429051 0.0220348 -0.0840526 -0.0127971 0.0378012 0.1253124 0.0050185 0.0748965 0.094621 0.1567787 0.0646022 0.0015688 -0.0193857 -0.004645 0.0724321 -0.0200447 0.0663816 0.0038814 0.002603 0.0509526 -0.0192637 0.0037223 -0.0051424 -0.0598018 -0.0861287 -0.0037816 -0.0192148 -0.0641205 0.0803305 -0.0317524 -0.0109039 -0.0179125 0.0646319 0.0266376 0.0189979 -0.0396629 -0.1279494 -0.0632562 0.0838316 -0.0426911 0.0867763 -0.0671455 0.0238216 -0.0628656 0.0411171 0.0601592 0.0675258 -0.0368097 -0.0378009 -0.0197274 0.0676394 -0.0087836 0.0213007 -0.0192171 -0.1230916 -0.0654686 0.0765322 -0.0406796 0.0990817 -0.0254738 0.0361632 -0.038014 0.0586574 0.0643109 0.0078685 -0.059362 -0.0079634 -0.0635641 -0.1896326 -0.0330039 -0.0001535 -0.0539522 0.0783485 0.0192512 0.0148354 -0.0180016 0.0195154 0.0927708 -0.0428896 0.0082166 0.0336062 -0.1700691 -0.1659237 -0.0625313 0.0610008 -0.0681421 -0.0112946 0.0124953 0.0931337 0.0242244 0.0588019 0.0914796 0.0295792 0.009583 0.0175245 0.0303398 -0.0073787 -0.0659762 -0.0357732 -0.1720604 unknown
polarizability: 115.6632514|16.8618859|110.653113|0.8920568|4.1162202|77.8928391 unknown
InChI: InChI=1S/C6H10BrNO3/c7-5-3-1-2-4-6(5)11-8(9)10/h5-6H,1-4H2
charge 0 multiplicity 1
21 atoms
Br 0.600824 -2.702669 -0.08204
O  -1.299624 -0.143271 0.686956
O  -2.298044 -0.474647 -1.472724
O  -3.477934 -0.874499 0.450023
N  -2.46967 -0.543085 -0.218854
C  -0.03422 0.175623 -0.03591
C  1.060052 -0.782849 0.456732
C  0.316421 1.646347 0.294865
C  2.4391 -0.408539 -0.114026
C  1.703439 2.028919 -0.275473
C  2.79365 1.061008 0.236722
H  -0.202353 0.044567 -1.120506
H  1.0666 -0.826738 1.55911
H  0.31285 1.77513 1.39448
H  -0.476794 2.297892 -0.11426
H  2.425292 -0.536039 -1.21354
H  3.199872 -1.10218 0.284974
H  1.943219 3.069706 0.010728
H  1.673697 1.999154 -1.383539
H  3.775069 1.310803 -0.207302
H  2.900051 1.168365 1.335085
