program: Gaussian 09
title: 000270331
version: EM64L-G09RevD.01
frameworkgroup: C1[X(C16H18O4S2)]
method: RPBEPBE
basis: SDD
operation: Freq
keyword: #p
keyword: freq=noraman
keyword: PBEPBE/SDD
title: #p freq=noraman PBEPBE/SDD
converged: YES YES NO NO
title: Mulliken charges:
elementType: S S O O O O C C C C C C C C C C C C C C C C H H H H H H H H H H H H H H H H H H
charge: 0.902595 0.882299 -0.536531 -0.523271 -0.523655 -0.531120 -0.583983 -0.011438 -0.704082 -0.681093 -0.049099 -0.024244 -0.215167 -0.271453 -0.218931 -0.260223 -0.213684 -0.208261 -0.214181 -0.204704 -0.211790 -0.214456 0.352927 0.228838 0.211962 0.248345 0.261241 0.275250 0.210267 0.217600 0.269662 0.294685 0.306087 0.291438 0.239105 0.244798 0.242023 0.245897 0.235096 0.241250
chargesum: 0.00000
title: Mulliken charges with hydrogens summed into heavy atoms:
elementType: S S O O O O C C C C C C C C C C C C C C C C
charge: 0.902595 0.882299 -0.536531 -0.523271 -0.523655 -0.531120 -0.231056 0.217400 0.017466 0.022025 -0.049099 -0.024244 0.054495 0.023233 0.087156 0.031214 0.025421 0.036537 0.027842 0.041193 0.023305 0.026794
polarizability: 2.93460493e+02 -1.45928928e+01 2.07243961e+02 -1.36496247e+01 -1.03213324e+01 2.09786447e+02
1716.lowfreq: -16.3402 -8.8520 -6.1014 -0.0011 -0.0007 0.0007 7.3655 23.8805 40.6618
frequency: -13.0876 23.6482 40.5718 43.9773 49.8304 69.2242 104.6729 112.9153 138.9179 144.7256 159.2928 163.2817 173.8022 188.7637 199.1813 215.3817 229.5337 234.5666 245.6357 248.9125 256.6594 324.7949 335.7010 343.8882 364.7944 389.3008 403.9721 404.2651 405.9587 424.0004 459.5949 497.0417 514.3466 600.8417 601.5750 613.6273 617.4983 653.3487 656.5883 683.4233 691.0042 758.3375 761.7768 789.5233 792.1235 818.4582 839.2790 855.3130 912.0836 923.6169 930.1580 931.4407 937.8755 963.1460 964.7458 973.0279 977.6813 979.0931 985.8480 1002.2832 1006.7676 1006.9241 1007.8173 1044.2224 1045.8081 1059.9682 1075.3048 1083.3506 1115.2448 1133.1609 1173.6557 1174.0731 1177.0734 1183.5875 1193.3423 1201.5028 1279.0299 1301.6508 1308.6022 1314.2641 1379.5460 1382.8763 1385.1378 1399.0914 1435.8522 1438.4217 1451.1343 1453.1528 1463.1562 1479.7237 1486.3921 1504.2475 1574.4378 1575.4351 1602.9233 1604.6179 2933.1891 2983.9154 2991.7343 3056.2536 3079.2717 3089.0542 3102.9777 3104.9949 3137.5557 3138.1721 3145.2100 3151.8871 3152.4728 3162.7280 3163.0072 3173.4846 3174.4605 3187.7895
redmass: 4.9313 5.8434 5.0998 4.1475 4.8844 4.9151 3.2302 6.9727 5.2333 7.1540 5.4795 5.6521 5.8684 11.4513 7.3084 1.8393 1.7090 2.7848 2.1223 7.4181 2.2502 4.7487 5.7619 6.6167 4.9826 8.6239 2.8262 2.8420 3.6675 5.2030 6.0899 4.2856 4.8535 6.4456 6.4498 5.4991 3.8222 6.9664 6.9941 2.2978 2.4899 1.4655 1.4104 14.4767 10.8016 3.2333 1.2541 1.2420 9.2199 8.6533 1.3936 1.2390 1.3524 1.7563 1.6074 3.0444 5.2150 1.9105 1.3863 1.3563 4.3288 4.5257 1.3429 2.0927 1.9989 1.3947 1.5236 1.5635 1.7142 1.3728 1.0559 1.0666 1.1172 1.1229 1.3824 1.9025 1.4325 1.3090 1.2851 1.3826 1.1765 8.0892 7.8611 1.1858 2.2460 2.2985 2.0216 1.9881 1.0404 1.0447 1.0478 1.0513 5.7698 5.7809 6.9057 6.9392 1.0806 1.0355 1.0353 1.0868 1.0995 1.0998 1.1013 1.1011 1.0861 1.0858 1.0883 1.0895 1.0927 1.0969 1.0940 1.0986 1.1016 1.0969
irintensity: 1.1611 2.9783 1.0377 0.0624 0.2654 0.4821 0.7335 1.8632 0.3908 4.6907 0.7342 1.6285 4.0737 0.2077 8.4759 0.7608 2.2286 1.7797 6.3694 2.5231 7.8284 26.2236 2.9723 5.5990 13.5237 14.9455 0.1350 0.3030 6.4347 7.2714 99.4468 148.8354 43.6069 0.0680 0.2018 10.8814 22.6549 2.1141 13.4193 44.4291 29.3644 68.3704 76.4876 80.2056 37.9805 2.8804 0.4709 0.3259 6.5441 118.8978 2.1230 15.5596 0.1554 11.0430 1.1600 1.6107 3.5976 0.6248 0.1160 0.1892 0.5578 0.6788 0.4646 33.0778 16.1154 11.6170 4.9849 5.0276 1.5413 13.2823 0.6008 1.2995 8.1690 9.6591 1.7146 4.1489 3.7171 4.5142 3.8529 16.3484 25.7469 5.9607 7.5335 27.6682 16.1938 16.1502 15.1087 14.4001 5.0911 14.0419 6.1166 19.4147 4.7377 1.5603 0.7169 0.3407 8.3417 34.3205 25.9643 2.2500 22.1142 21.8250 1.5645 7.0954 1.9337 0.9395 7.0487 11.5844 0.2587 5.3619 8.3893 17.3248 28.9890 10.3422
temp: 298.150 k
press: 1.00000 atm
elementType: 16 16 8 8 8 8 6 6 6 6 6 6 6 6 6 6 6 6 6 6 6 6 1 1 1 1 1 1 1 1 1 1 1 1 1 1 1 1 1 1
symmnumber: 1
zpe: 792852.1 jmol-1
zpe.correction: 0.301981 hartree
zpe.thermalcorrener: 0.324234 hartree
zpe.thermalcorrenthalpy: 0.325178 hartree
zpe.thermalcorrgfe: 0.250383 hartree
zpe.sumelectzpe: -1715.556916 hartree
zpe.sumelectthermal: -1715.534664 hartree
zpe.sumelectthermalent: -1715.533720 hartree
zpe.sumelectthermalfe: -1715.608514 hartree
dipole: -5.4065 -0.5916 -3.0162
dipole: 6.2191
quadrupole: -113.5296 -151.3949 -148.8575
quadrupole: -14.7262 -10.9342 -7.7058
quadrupole: 24.3978 -13.4676 -10.9302 -14.7262 -10.9342 -7.7058
hfenergy: -1715.8588977 hartree
pointgroup: C01[X(C16H18O4S2)]
dipole: -2.2210645 -0.3248871 -0.9737265 debye
polarizability: 291.3066888|-5.6686643|207.5739432|-22.8731692|-11.2915248|211.6102695 unknown
InChI: InChI=1S/C16H18O4S2/c1-13(2)16(21(17,18)14-9-5-3-6-10-14)22(19,20)15-11-7-4-8-12-15/h3-13,16H,1-2H3
charge 0 multiplicity 1
40 atoms
S  1.678616 1.241832 1.283923
S  -0.657764 -0.818237 0.269344
O  2.103021 2.747462 0.79549
O  1.791074 0.819959 2.855749
O  0.045259 -1.831103 1.34272
O  -0.370027 -0.925347 -1.336292
C  -0.291344 1.032073 0.896098
C  -0.928009 2.1117 0.026806
C  -0.255987 2.323749 -1.354136
C  -1.032855 3.440414 0.82895
C  2.700159 0.023642 0.248297
C  -2.53902 -0.961051 0.519169
C  3.181467 0.471227 -0.991511
C  -3.366528 -0.766946 -0.598146
C  2.993889 -1.226488 0.813797
C  -3.003135 -1.324109 1.793895
C  4.004155 -0.413322 -1.724891
C  -4.76025 -0.9235 -0.411326
C  3.823087 -2.091448 0.063164
C  -4.400314 -1.472799 1.95942
C  4.318807 -1.688785 -1.199059
C  -5.271743 -1.267275 0.862891
H  -0.661519 0.976763 1.936676
H  -1.969494 1.758835 -0.152012
H  -0.893338 2.9858 -1.96674
H  0.723944 2.813617 -1.227569
H  -0.125919 1.368843 -1.891822
H  -0.02829 3.850153 1.025612
H  -1.556047 3.298442 1.792766
H  -1.603796 4.176654 0.234818
H  2.945433 1.475587 -1.356304
H  -2.931467 -0.537566 -1.577012
H  2.594225 -1.507104 1.791307
H  -2.300361 -1.515735 2.611956
H  4.398359 -0.104037 -2.698257
H  -5.439867 -0.784777 -1.258442
H  4.071882 -3.079089 0.46422
H  -4.802796 -1.756721 2.93719
H  4.957092 -2.369194 -1.773284
H  -6.351794 -1.388515 0.998844
