program: Gaussian 09
title: 000270330
version: EM64L-G09RevD.01
frameworkgroup: C1[X(C19H15N3O3)]
method: RPBEPBE
basis: SDD
operation: Freq
keyword: #p
keyword: freq=noraman
keyword: PBEPBE/SDD
title: #p freq=noraman PBEPBE/SDD
converged: YES YES NO NO
title: Mulliken charges:
elementType: O O O N N N C C C C C C C C C C C C C C C C C C C H H H H H H H H H H H H H H H
charge: -0.262675 -0.205074 -0.213134 -0.369205 -0.498809 0.017303 0.264225 0.426097 0.206703 0.532313 -0.342186 -0.365162 -0.364584 -0.339519 -0.601461 -0.346152 -0.202797 -0.218543 -0.204904 -0.220266 0.426966 -0.237457 -0.249611 -0.172254 -0.393786 0.345174 0.266532 0.255678 0.271590 0.267431 0.282789 0.318627 0.236793 0.227604 0.238681 0.228782 0.238519 0.230711 0.238622 0.286440
chargesum: 0.00000
title: Mulliken charges with hydrogens summed into heavy atoms:
elementType: O O O N N N C C C C C C C C C C C C C C C C C C C
charge: -0.262675 -0.205074 -0.213134 -0.369205 -0.153635 0.017303 0.264225 0.426097 0.206703 0.532313 -0.075654 -0.109484 -0.092993 -0.072088 -0.318672 -0.027525 0.033995 0.009061 0.033777 0.008517 0.426966 0.001062 -0.018900 0.066368 -0.107346
polarizability: 3.50857927e+02 1.30689934e+01 2.75020165e+02 9.63162075e+00 9.20206794e-01 1.37959154e+02
1716.lowfreq: -3.8314 -0.0003 0.0003 0.0005 1.9396 4.0222 15.7991 24.6645 32.8275
frequency: 15.7151 24.6417 32.8235 46.1669 52.5197 60.1826 67.9529 91.6454 107.3043 136.8090 170.3741 205.6071 209.5422 244.3362 252.0454 271.2831 304.6319 333.2553 392.1604 402.5847 405.8358 408.5850 426.6028 434.7442 491.6653 515.3804 523.4906 534.1222 566.0696 611.2759 614.7989 631.6931 637.5587 651.7550 675.8481 682.4951 694.4604 696.6486 701.8257 708.6950 748.7390 764.1235 770.3446 817.6311 827.0253 836.1850 852.1820 872.4793 909.2435 913.5533 923.8672 938.4925 947.0019 968.8361 979.6517 982.9822 987.3571 988.2695 990.4170 999.7231 1006.7549 1013.7585 1027.2601 1033.8794 1079.2570 1084.5496 1091.1831 1091.4465 1173.3367 1174.2626 1174.5166 1177.1052 1183.2340 1193.5168 1216.8576 1233.2276 1261.8737 1281.1633 1309.2781 1314.5377 1325.9723 1368.5747 1372.8957 1383.1441 1385.0080 1435.1071 1438.2681 1443.9558 1477.4254 1480.9246 1487.0358 1513.7302 1584.8713 1588.5804 1593.9644 1602.1387 1607.4561 1621.0874 1629.8965 3130.1767 3134.7697 3139.7799 3140.8131 3152.4706 3153.3086 3154.2320 3155.8535 3160.4657 3167.0370 3173.6242 3187.1698 3191.7153 3198.0600 3506.8731
redmass: 7.0228 4.1482 6.4961 5.6943 4.2816 9.2426 5.2057 6.5827 6.4269 7.0109 5.4400 6.2862 5.7165 4.6938 4.3315 5.6459 5.1366 8.0245 6.9679 6.1262 3.2979 2.9014 3.5741 5.1853 5.2037 3.6738 5.8080 4.1176 5.3361 5.7823 5.7616 1.8061 2.9468 6.7193 6.7666 2.3980 2.0412 5.5690 2.2213 5.5031 3.9852 1.8056 2.2797 1.3921 5.9473 1.2603 1.2630 5.4720 1.4705 1.6086 1.5405 3.9558 1.3631 1.3835 1.3932 5.9396 3.9786 5.4909 1.5198 1.3179 1.3320 4.4070 2.0510 2.3372 1.5576 1.6992 1.6350 1.6530 1.0620 1.4698 1.0625 1.5245 1.2647 1.1959 7.1689 2.9986 2.4829 3.0071 1.7103 1.4873 1.3530 6.9963 7.6412 6.1651 9.2308 3.4157 2.5255 2.3344 2.3465 2.3680 2.6724 2.1514 6.3849 6.0790 6.2033 5.8819 5.8509 5.7665 6.9974 1.0849 1.0854 1.0893 1.0884 1.0929 1.0899 1.0939 1.0918 1.0969 1.0994 1.1017 1.0961 1.0934 1.0967 1.0760
irintensity: 0.9180 0.7803 0.6500 2.0762 0.9931 0.6574 0.6013 4.0329 2.2352 3.3541 0.3583 3.5450 1.3768 0.8972 2.0702 6.2008 0.1696 1.5228 9.6853 0.4314 3.1557 0.4238 0.1226 1.6191 1.0324 16.2878 4.0485 11.7912 49.1221 0.5561 0.5881 25.8712 23.5546 11.5130 2.5112 13.6774 34.9527 8.1497 68.1803 39.1837 18.6963 67.0369 29.1841 38.9593 3.0246 0.8131 0.5504 1.9019 1.6401 39.5879 0.9430 1.0506 0.6674 0.3389 0.2821 2.8459 0.1617 1.2573 0.1744 0.1040 3.3863 4.3773 10.8913 3.2100 11.2066 19.2279 5.8898 22.9562 1.6182 21.3987 0.4978 85.1324 32.0677 29.1832 318.9806 530.9131 67.8547 147.9210 95.3478 8.4516 5.8317 214.7558 9.2972 105.1493 3.0319 21.2805 16.8712 5.5122 63.2864 274.1860 30.0169 674.7107 13.1531 43.9399 3.0804 50.3401 51.3047 77.3825 245.6346 1.7871 1.9851 10.0043 2.5568 16.7036 10.5118 27.2343 7.8116 15.1663 25.0086 12.4661 2.2075 9.1893 5.2999 45.5748
temp: 298.150 k
press: 1.00000 atm
elementType: 8 8 8 7 7 7 6 6 6 6 6 6 6 6 6 6 6 6 6 6 6 6 6 6 6 1 1 1 1 1 1 1 1 1 1 1 1 1 1 1
symmnumber: 1
zpe: 791094.2 jmol-1
zpe.correction: 0.301312 hartree
zpe.thermalcorrener: 0.322067 hartree
zpe.thermalcorrenthalpy: 0.323012 hartree
zpe.thermalcorrgfe: 0.248405 hartree
zpe.sumelectzpe: -1121.155184 hartree
zpe.sumelectthermal: -1121.134428 hartree
zpe.sumelectthermalent: -1121.133484 hartree
zpe.sumelectthermalfe: -1121.208091 hartree
dipole: -5.3682 1.5520 0.0779
dipole: 5.5886
quadrupole: -169.4646 -132.8011 -141.0273
quadrupole: -17.7884 7.7184 4.5685
quadrupole: -21.7003 14.9633 6.7370 -17.7884 7.7184 4.5685
hfenergy: -1121.4564958 hartree
pointgroup: C01 [X(C19H15N3O3)]
dipole: -2.1074283 0.6268937 0.0103642 debye
polarizability: 351.0908646|12.8785543|274.6732859|8.5887113|-4.7589935|138.0730956 unknown
InChI: InChI=1S/C19H15N3O3/c23-19(20-15-8-7-13-18(14-15)22(24)25)21(16-9-3-1-4-10-16)17-11-5-2-6-12-17/h1-14,20H
charge 0 multiplicity 1
40 atoms
O  -0.625792 -2.181942 0.496047
O  6.699998 0.083461 -0.204083
O  5.195687 1.738776 -0.644137
N  -1.683709 -0.107832 0.096395
N  0.673946 -0.283511 0.006736
N  5.491928 0.526214 -0.307248
C  -1.561994 1.337315 0.054623
C  -3.014577 -0.677446 0.045787
C  -0.543715 -0.949189 0.228889
C  1.979756 -0.814759 0.133019
C  -2.025073 2.048473 -1.081116
C  -4.084954 0.01914 0.66271
C  -1.006456 2.042818 1.153496
C  -3.269485 -1.895836 -0.633939
C  3.059273 0.065938 -0.135618
C  2.254904 -2.161535 0.510667
C  -1.923855 3.455984 -1.118892
C  -5.396788 -0.496555 0.59632
C  -0.894382 3.450484 1.101984
C  -4.583268 -2.407225 -0.684469
C  4.377684 -0.412674 -0.02161
C  -1.353607 4.160807 -0.03183
C  -5.654525 -1.713291 -0.075208
C  3.591994 -2.600272 0.615565
C  4.677508 -1.740154 0.352498
H  0.6170 0.702386 -0.261764
H  -2.464412 1.49443 -1.917019
H  -3.891654 0.956363 1.194164
H  -0.67553 1.488486 2.038554
H  -2.448389 -2.445392 -1.098923
H  2.898558 1.10857 -0.429292
H  1.42065 -2.835989 0.70998
H  -2.282391 4.001079 -1.998605
H  -6.214628 0.050841 1.077839
H  -0.461749 3.990418 1.950985
H  -4.769135 -3.351633 -1.207793
H  -1.27141 5.25223 -0.066878
H  -6.672206 -2.115327 -0.121586
H  3.78558 -3.637583 0.907412
H  5.717719 -2.06447 0.427239
