program: Gaussian 09
title: 000270328
version: EM64L-G09RevD.01
frameworkgroup: C1[X(C14H13N3O3)]
method: RPBEPBE
basis: SDD
operation: Freq
keyword: #p
keyword: freq=noraman
keyword: PBEPBE/SDD
title: #p freq=noraman PBEPBE/SDD
converged: YES YES NO NO
title: Mulliken charges:
elementType: O O O N N N C C C C C C C C C C C C C C H H H H H H H H H H H H H
charge: -0.273605 -0.222960 -0.216999 -0.279305 -0.508568 0.019309 0.448702 0.498924 0.258678 -0.702080 -0.319954 -0.372543 -0.427339 -0.299355 0.390986 -0.349826 -0.365566 -0.220435 -0.220074 -0.245815 0.331999 0.233732 0.243617 0.272836 0.277646 0.238810 0.225928 0.319800 0.286163 0.285727 0.230405 0.228499 0.232665
chargesum: 0.00000
title: Mulliken charges with hydrogens summed into heavy atoms:
elementType: O O O N N N C C C C C C C C C C C C C C
charge: -0.273605 -0.222960 -0.216999 -0.279305 -0.176569 0.019309 0.448702 0.498924 0.258678 0.048105 -0.042307 -0.133734 -0.201412 0.020445 0.390986 -0.063663 -0.079839 0.009970 0.008425 -0.013150
polarizability: 3.68108908e+02 -2.68236158e-03 1.84423577e+02 -7.82395592e+00 -8.66452265e+00 8.55722953e+01
1716.lowfreq: -0.0006 0.0003 0.0006 4.2390 5.1976 14.0689 22.2759 28.2258 54.5712
frequency: 22.2220 28.2137 54.5685 65.0686 67.1369 81.0126 129.4868 138.9831 174.7125 191.0817 209.0813 250.4129 287.6611 314.6640 350.6976 354.4744 395.7272 406.5759 415.8909 418.9673 499.0953 504.8755 515.1678 553.2403 594.3895 613.1365 615.1059 636.3809 663.0233 667.2205 695.9074 703.7781 736.4137 755.8115 770.2076 792.5969 831.5808 833.3789 851.8214 878.6847 908.9819 941.1020 966.9482 976.9443 987.3983 991.6835 998.2140 1010.7215 1028.2274 1083.6457 1097.6642 1102.0225 1111.8327 1117.8891 1127.0589 1174.4912 1178.8496 1192.5631 1219.6084 1229.6159 1265.8143 1298.8247 1317.3804 1329.8078 1351.5625 1382.0610 1388.2135 1431.8224 1441.1329 1442.2321 1483.5987 1486.5237 1491.6231 1497.3308 1516.4727 1590.7423 1596.0391 1607.2409 1615.5801 1632.9909 2953.1379 3035.7186 3115.2827 3121.3929 3128.2933 3137.7185 3149.5230 3166.7044 3177.9505 3183.9749 3199.3527 3205.3748 3545.0460
redmass: 4.5534 6.7881 7.2684 4.5206 7.1671 6.0029 4.8534 5.1204 3.7022 4.3008 2.7441 2.2915 4.9882 4.5358 3.1105 6.8313 6.1494 3.1391 3.5222 3.6774 2.7083 5.0863 4.2504 5.2718 1.3269 5.3839 6.4652 6.6847 6.7659 4.7495 1.8510 9.4559 4.6989 4.6841 2.1626 6.4854 1.3915 1.2517 5.9235 1.4949 1.4293 3.9660 1.3745 1.3384 4.3735 1.4388 3.0731 1.3158 2.2263 1.7014 2.9654 1.5200 1.5004 1.3401 3.0000 1.0498 1.4468 1.1273 3.5007 4.7014 2.0848 1.4533 1.9952 1.9468 7.2718 8.7334 5.7455 4.5097 1.6013 1.6137 1.6724 1.5700 2.2184 1.0734 1.8535 6.5672 6.4318 5.7161 5.6395 5.8254 1.0413 1.0990 1.0950 1.0906 1.0852 1.0887 1.0945 1.1001 1.0909 1.0945 1.0951 1.0954 1.0755
irintensity: 0.3463 0.0440 3.0851 2.1994 2.9237 3.2118 2.0378 0.6883 1.0464 0.6069 0.3569 2.5952 7.1049 3.9224 0.7986 0.2884 7.1397 0.2698 2.8812 2.4314 30.2335 2.3673 5.7001 6.2687 36.4839 7.9040 1.7726 4.8901 13.5578 25.7422 51.2058 11.2112 5.1969 26.2110 44.2022 19.0462 27.6058 0.8536 1.0291 67.8206 4.2442 7.3712 0.5872 1.2870 0.1577 0.3518 0.3560 0.3092 26.8740 14.3261 31.5270 103.3864 120.8589 15.2465 236.8597 2.7826 268.1548 2.1926 553.3414 221.6552 167.9011 78.7370 59.8457 89.3732 125.6326 1.0309 368.2318 45.3808 28.3978 33.5099 22.3391 490.1661 30.7465 18.5686 298.1559 7.7885 56.0589 62.6898 189.1507 238.6083 48.2443 25.5575 13.5262 14.9126 4.2642 3.9384 31.8471 27.7139 2.1314 2.9218 1.0720 7.4310 25.8382
temp: 298.150 k
press: 1.00000 atm
elementType: 8 8 8 7 7 7 6 6 6 6 6 6 6 6 6 6 6 6 6 6 1 1 1 1 1 1 1 1 1 1 1 1 1
symmnumber: 1
zpe: 656752.1 jmol-1
zpe.correction: 0.250144 hartree
zpe.thermalcorrener: 0.267539 hartree
zpe.thermalcorrenthalpy: 0.268483 hartree
zpe.thermalcorrgfe: 0.202738 hartree
zpe.sumelectzpe: -929.729298 hartree
zpe.sumelectthermal: -929.711903 hartree
zpe.sumelectthermalent: -929.710959 hartree
zpe.sumelectthermalfe: -929.776704 hartree
dipole: 8.0145 5.5272 0.8549
dipole: 9.7731
quadrupole: -152.5654 -103.3746 -118.0543
quadrupole: -2.9542 -1.8035 -2.4334
quadrupole: -27.9006 21.2901 6.6105 -2.9542 -1.8035 -2.4334
hfenergy: -929.9794418 hartree
pointgroup: C01 [X(C14H13N3O3)]
dipole: -3.1508265 2.1845828 -0.2900476 debye
polarizability: 368.1686434|0.0705199|183.8791732|-6.6539393|11.3436569|86.0569636 unknown
InChI: InChI=1S/C14H13N3O3/c1-16(12-5-3-2-4-6-12)14(18)15-11-7-9-13(10-8-11)17(19)20/h2-10,15H,1H3
charge 0 multiplicity 1
33 atoms
O  -0.96578 -1.132074 0.043069
O  6.50458 0.518624 0.115734
O  5.979873 -1.703882 0.111828
N  -2.233143 0.841084 -0.220872
N  0.126322 0.948072 -0.059329
N  5.648291 -0.453253 0.098798
C  -3.507627 0.168945 -0.078629
C  1.475111 0.532431 -0.01236
C  -1.026416 0.125276 -0.074631
C  -2.244245 2.299916 -0.470009
C  -3.740955 -1.108628 -0.649597
C  -4.555527 0.824107 0.619554
C  2.464986 1.561297 0.0087
C  1.884463 -0.832817 0.010271
C  4.215787 -0.113841 0.061765
C  3.829554 1.246431 0.045881
C  3.25282 -1.147976 0.044799
C  -5.009641 -1.712435 -0.517987
C  -5.824091 0.215605 0.734951
C  -6.058364 -1.057002 0.167564
H  -0.008492 1.95976 -0.044079
H  -1.997587 2.896182 0.432551
H  -1.547923 2.562262 -1.288608
H  -3.250105 2.593965 -0.80298
H  -2.935262 -1.6246 -1.173878
H  -4.379064 1.795727 1.09438
H  2.156335 2.614303 -0.006167
H  1.126063 -1.616064 0.009157
H  4.59809 2.023245 0.061642
H  3.588553 -2.188283 0.06203
H  -5.17857 -2.699905 -0.961416
H  -6.622078 0.7321 1.279708
H  -7.04066 -1.532169 0.260958
