program: Gaussian 09
title: 000275905
version: EM64L-G09RevD.01
frameworkgroup: C1[X(C19H21ClFN5O2S)]
method: RPBEPBE
basis: SDD
operation: Freq
keyword: #p
keyword: freq=noraman
keyword: PBEPBE/SDD
title: #p freq=noraman PBEPBE/SDD
converged: YES YES NO NO
title: Mulliken charges:
elementType: Cl S F O O N N N N N C C C C C C C C C C C C C C C C C C C H H H H H H H H H H H H H H H H H H H H H
charge: -0.063243 1.092166 -0.346452 -0.480565 -0.478851 -0.312428 -0.086585 -0.164390 -0.626028 -0.612155 0.188592 0.355935 -0.722091 -0.675673 0.212665 0.634087 -0.594742 -0.350059 -0.374194 -0.583228 -0.326842 -0.408681 -0.017310 0.530955 -0.398016 -0.363896 -0.108705 -0.219596 -0.226555 0.245333 0.216708 0.236764 0.238007 0.237118 0.195118 0.235730 0.256035 0.287032 0.251932 0.228764 0.249589 0.242442 0.338381 0.336658 0.252755 0.262008 0.286689 0.286450 0.319273 0.323099
chargesum: 0.00000
title: Mulliken charges with hydrogens summed into heavy atoms:
elementType: Cl S F O O N N N N N C C C C C C C C C C C C C C C C C C C
charge: -0.063243 1.092166 -0.346452 -0.480565 -0.478851 -0.312428 -0.086585 -0.164390 0.049011 0.030216 0.188592 0.355935 -0.023285 -0.005429 0.212665 0.634087 -0.102978 -0.063027 -0.122263 -0.104874 -0.326842 -0.166239 -0.017310 0.530955 -0.145261 -0.101887 -0.108705 0.067093 0.059894
polarizability: 5.01710411e+02 -1.34784208e+01 2.49533746e+02 1.30880471e+01 1.04285151e+01 1.93810816e+02
1716.lowfreq: -9.4455 -2.2655 -0.0015 -0.0009 -0.0008 1.8067 12.0957 13.3471 15.5304
frequency: 11.6629 13.0548 15.5032 19.9858 33.1840 40.6717 43.2867 64.3510 81.4764 91.6139 95.6637 128.0304 131.9360 146.9300 181.9717 188.1236 205.3126 209.4199 222.5708 227.6265 239.2664 246.5082 259.9969 268.2040 299.1491 306.6094 313.7246 317.3038 338.4628 362.6449 369.9915 381.8897 383.4103 387.2531 399.5993 404.2024 416.0816 436.2583 452.5093 457.8827 489.9746 504.2267 510.2482 517.6450 524.4617 533.0747 540.3879 559.5448 596.3334 605.2435 618.1713 631.5167 658.9622 672.0110 696.7525 721.2306 723.2038 727.1886 780.6520 793.0179 811.4789 821.7384 838.9167 842.8296 854.0963 861.4136 869.3370 889.9371 911.3252 944.4618 955.3110 961.0421 964.6902 982.5685 987.8213 989.3499 990.8939 996.9020 998.6015 1024.5564 1039.4657 1046.8348 1101.3901 1104.8122 1121.4573 1131.2104 1132.8596 1163.2270 1184.1619 1194.5197 1209.9273 1215.4778 1240.1887 1253.3899 1271.8168 1276.9891 1288.9601 1301.5531 1322.9287 1352.0693 1367.5929 1389.5610 1389.6755 1395.9655 1400.9798 1402.0556 1431.0289 1448.6552 1461.0757 1465.5604 1467.9056 1471.6039 1476.9901 1481.7559 1484.6805 1537.3063 1549.7649 1570.3132 1588.5220 1590.4019 1604.1475 1613.4060 1620.3854 2981.8922 2997.8652 3003.3941 3007.3699 3050.4647 3074.3622 3080.0728 3095.3198 3105.5975 3112.8520 3129.4493 3139.1364 3141.3010 3165.9680 3168.1373 3168.5725 3172.5755 3551.8972 3566.8342 3706.4367 3728.2873
redmass: 8.2831 7.6876 8.5263 5.0964 4.8127 4.9392 6.9044 5.4594 7.3190 6.9121 5.9317 4.0037 5.5585 5.7619 6.5619 5.4601 2.8956 2.9791 1.9474 9.6618 4.1922 2.3200 1.2846 3.6640 6.6409 2.7947 4.6960 2.9277 4.5153 4.0285 3.6121 4.0296 1.2673 1.3093 3.7003 2.9070 4.2847 7.7682 3.4574 3.2925 2.3594 2.5886 2.4149 5.4914 1.2779 1.9375 3.3015 8.2369 4.6622 5.5746 6.9001 4.6644 5.9624 8.6038 4.6954 4.2152 6.2321 4.9991 1.3020 3.1906 3.7159 2.2661 1.4750 1.2600 15.2024 2.5926 2.6912 1.5578 1.5695 1.9808 3.0682 1.6886 1.3862 1.5492 2.8528 1.6994 3.3124 3.9676 2.6406 2.7246 3.5175 2.4253 1.3927 1.8985 2.2351 2.0026 1.3038 1.1357 1.1257 3.3036 1.9553 2.6731 4.1309 1.5055 1.2963 2.1241 1.8684 1.2699 1.3625 3.8351 1.2365 7.0267 1.3617 4.2429 3.4162 2.7084 4.9342 1.0541 1.0693 1.9608 1.0792 1.2560 1.1414 2.1967 1.1525 2.6289 5.5571 1.7608 6.0688 7.2820 3.9831 2.8756 2.2647 1.0351 1.0591 1.0356 1.0596 1.1017 1.1050 1.0996 1.0999 1.1006 1.0994 1.0897 1.0898 1.0896 1.0956 1.0943 1.0970 1.0936 1.0444 1.0438 1.1052 1.1058
irintensity: 1.0394 0.5961 1.0677 0.9890 0.2870 0.0719 0.6845 1.7053 0.7643 1.5271 1.4531 0.2180 1.9932 0.7617 3.1458 5.1642 2.8143 0.1750 4.8015 2.8217 5.6904 2.9787 0.1115 4.9814 3.4239 9.7113 2.7227 1.4635 6.4291 12.3809 2.6623 17.7926 16.2564 311.6930 49.2400 0.8331 25.2075 83.1248 9.1661 8.1335 65.1879 9.2583 11.4338 3.7960 13.2016 74.4300 7.1290 150.5625 43.1207 22.4638 0.2067 5.2526 4.0446 11.4001 27.1516 1.6638 8.1647 16.8839 1.5112 2.1088 61.3208 32.9985 66.0002 4.0549 95.9482 1.4482 19.2008 4.2120 2.0290 7.0480 32.3708 2.9589 0.1058 10.0910 6.7607 0.4541 53.2120 2.3419 22.9202 18.0920 8.6734 43.9900 2.4210 4.5574 1.7542 48.7460 7.8417 8.9301 3.5403 44.8611 6.4861 18.9278 20.0417 16.0682 25.4239 51.3278 80.5819 1.2376 16.4213 3.4355 35.0380 5.6135 43.3808 17.9643 426.5545 12.2894 251.2951 4.1615 5.2637 9.3531 15.9193 22.1531 14.0404 142.9130 23.0292 294.6165 37.6181 195.1776 51.6571 4.7699 528.5552 250.6610 391.0623 20.1271 2.2873 14.9618 37.7173 0.1036 14.6668 30.8926 14.2856 25.5259 30.2590 11.7206 5.9463 4.7221 0.1632 4.2039 8.4036 3.6899 57.8356 105.1580 49.6516 39.3969
temp: 298.150 k
press: 1.00000 atm
elementType: 17 16 9 8 8 7 7 7 7 7 6 6 6 6 6 6 6 6 6 6 6 6 6 6 6 6 6 6 6 1 1 1 1 1 1 1 1 1 1 1 1 1 1 1 1 1 1 1 1 1
symmnumber: 1
zpe: 989340.4 jmol-1
zpe.correction: 0.376820 hartree
zpe.thermalcorrener: 0.406182 hartree
zpe.thermalcorrenthalpy: 0.407126 hartree
zpe.thermalcorrgfe: 0.312327 hartree
zpe.sumelectzpe: -2116.524671 hartree
zpe.sumelectthermal: -2116.495309 hartree
zpe.sumelectthermalent: -2116.494364 hartree
zpe.sumelectthermalfe: -2116.589163 hartree
dipole: 6.5639 1.5596 2.5252
dipole: 7.2037
quadrupole: -281.3441 -176.4771 -185.7036
quadrupole: -8.6221 4.0304 1.0703
quadrupole: -66.8358 38.0312 28.8047 -8.6221 4.0304 1.0703
hfenergy: -2116.9014906 hartree
pointgroup: C01 [X(C19H21Cl1F1N5O2S1)]
dipole: -2.5766886 1.0900303 0.452681 debye
polarizability: 502.102829|-9.9673841|199.5922293|12.089603|20.0888691|243.3599152 unknown
InChI: InChI=1S/C19H21ClFN5O2S/c1-19(2)25-17(22)24-18(23)26(19)14-8-7-13(16(20)11-14)6-3-12-4-9-15(10-5-12)29(21,27)28/h4-5,7-11H,3,6,22-23H2,1-2H3
charge 0 multiplicity 1
50 atoms
Cl 0.014606 -1.375407 -2.18717
S  8.214843 -0.305514 -0.108444
F  8.72801 1.017497 -1.310923
O  8.846298 0.122757 1.306114
O  8.565796 -1.702195 -0.821392
N  -4.420623 0.176351 0.119386
N  -6.617688 -0.960908 0.316818
N  -6.288269 0.938177 -1.20152
N  -4.199594 1.930902 -1.479036
N  -8.206329 -0.385544 -1.31176
C  -5.410861 -0.5634 1.060727
C  -2.998019 0.03986 0.22812
C  -4.751829 -1.847129 1.598434
C  -5.81354 0.398665 2.212349
C  -5.001725 1.000691 -0.848101
C  -0.140167 -0.300242 0.413317
C  1.365201 -0.450376 0.517366
C  -2.263741 -0.511506 -0.858346
C  -2.295973 0.419056 1.402031
C  2.127562 0.720144 -0.191883
C  -0.872178 -0.655064 -0.747111
C  -0.900437 0.238007 1.485063
C  -7.001555 -0.162809 -0.671029
C  3.628766 0.49718 -0.182786
C  4.460704 1.154519 0.761152
C  4.216772 -0.411713 -1.104706
C  6.376395 0.019324 -0.142454
C  5.853241 0.92611 0.792755
C  5.604401 -0.660541 -1.099654
H  -5.516538 -2.390285 2.176939
H  -3.886634 -1.644523 2.251233
H  -4.435995 -2.494648 0.763042
H  -6.58537 -0.090935 2.830978
H  -6.241556 1.33031 1.801424
H  -4.953731 0.651105 2.859967
H  1.668093 -0.483061 1.579846
H  1.684084 -1.402854 0.055947
H  -2.790518 -0.830104 -1.762077
H  -2.84455 0.856377 2.241002
H  1.871283 1.669874 0.312367
H  1.76244 0.788789 -1.232814
H  -0.374647 0.52571 2.403171
H  -4.63254 2.482345 -2.215838
H  -3.259114 2.141509 -1.156944
H  4.018846 1.858592 1.475021
H  3.582793 -0.921113 -1.83939
H  6.502998 1.426897 1.517092
H  6.06677 -1.358691 -1.804254
H  -8.802433 -1.145538 -0.997508
H  -8.450148 0.188156 -2.113225
