program: Gaussian 09
title: 000270320
version: EM64L-G09RevD.01
frameworkgroup: C1[X(C11H16O4S2)]
method: RPBEPBE
basis: SDD
operation: Freq
keyword: #p
keyword: freq=noraman
keyword: PBEPBE/SDD
title: #p freq=noraman PBEPBE/SDD
converged: YES YES NO NO
title: Mulliken charges:
elementType: S S O O O O C C C C C C C C C C C H H H H H H H H H H H H H H H H
charge: 0.941250 0.934781 -0.544655 -0.522777 -0.523244 -0.584518 -0.792277 0.563916 -0.517393 -0.490626 -0.375660 -0.363959 -0.640199 -0.639471 -0.211257 -0.238244 -0.225436 0.347448 0.321106 0.267979 0.259338 0.280873 0.247514 0.294588 0.231981 0.242189 0.268758 0.233573 0.252421 0.264038 0.239859 0.238907 0.239199
chargesum: 0.00000
title: Mulliken charges with hydrogens summed into heavy atoms:
elementType: S S O O O O C C C C C C C C C C C
charge: 0.941250 0.934781 -0.544655 -0.522777 -0.523244 -0.584518 -0.444828 0.563916 0.071691 0.049584 -0.128146 -0.069371 0.102729 0.110560 0.028602 0.000662 0.013763
polarizability: 2.24611816e+02 1.78398744e+01 2.02420657e+02 -2.01619665e+00 -1.91900280e+00 1.61970532e+02
1716.lowfreq: 0.0017 0.0022 0.0026 3.0148 10.2201 14.1211 22.1785 38.3608 40.3187
frequency: 21.9426 38.3335 40.2910 59.1105 61.3881 66.3062 78.9964 121.5360 133.0116 144.3035 173.5575 185.9544 191.9670 196.1102 203.7875 217.0172 228.4140 240.9773 268.8060 278.3293 330.6768 335.6788 368.5863 402.2561 454.5220 460.9183 482.0563 509.4964 570.4864 592.0489 606.1314 648.4490 701.2225 775.6686 780.5235 790.0560 798.6902 808.5987 826.6499 861.5591 904.8885 924.5858 944.0597 968.5114 971.2163 985.3762 992.2557 1010.1568 1027.5875 1030.7281 1057.7616 1062.0383 1065.9298 1082.7401 1089.9192 1162.8274 1178.6265 1198.2719 1231.4426 1234.9543 1237.9028 1251.8872 1278.9756 1332.6425 1381.6249 1395.0756 1396.0353 1414.9483 1438.2714 1439.0684 1456.9293 1459.4866 1478.6960 1479.4293 1482.2739 1579.6065 1604.1202 2991.7705 2992.5636 3008.8995 3049.3670 3085.1141 3086.8458 3087.6803 3104.8839 3105.4501 3121.8749 3130.4741 3135.7088 3144.8770 3147.4190 3156.0910 3171.1902
redmass: 4.4601 4.6004 3.0674 3.2164 3.6769 4.1981 4.9241 4.6511 5.1390 7.2402 6.2910 1.4530 1.5933 5.2022 3.4700 4.8478 3.8187 4.7796 2.5694 2.7875 7.6584 8.1450 4.7547 2.8922 5.4781 5.3227 6.1359 7.2058 6.5833 4.8089 6.3949 6.2830 1.8087 2.0327 1.7732 2.5410 1.5574 3.3730 4.9040 1.2460 5.2063 4.4821 1.4154 1.6021 1.5773 4.3827 1.5076 1.3133 1.8234 1.4849 2.1062 2.4333 1.4420 1.6561 1.3309 1.2342 1.0607 1.1251 1.2706 1.2605 1.3247 2.9066 1.1793 1.2862 7.1664 1.1777 1.1716 1.1195 1.2916 1.7320 1.0380 1.0345 1.9948 1.1020 1.0523 5.6941 5.7693 1.0367 1.0364 1.0620 1.0580 1.0968 1.0968 1.0880 1.1023 1.1016 1.0896 1.1065 1.0867 1.0915 1.1093 1.0962 1.1015
irintensity: 3.9896 1.6580 0.6083 1.8542 1.1680 0.3100 0.1956 2.2171 1.9402 1.8102 2.3257 0.9746 1.2006 4.6951 4.1265 23.2748 6.8013 23.2320 4.5838 4.9288 10.8257 16.5584 4.1203 1.0979 22.5652 69.7846 17.1708 45.1105 2.7898 12.6873 0.8206 1.7073 42.2620 10.9905 57.2129 39.0355 9.8431 59.7275 2.6582 0.7999 66.2162 70.5747 3.3527 55.0563 21.6096 0.6570 0.2308 0.1912 7.9722 1.6904 3.3211 5.2571 14.6504 7.3287 5.9537 4.3692 0.1889 2.5590 2.0878 8.3694 9.2836 14.6285 4.8231 1.9367 0.3041 26.0576 32.1718 1.4544 10.8723 12.0121 18.8521 20.5459 7.2716 13.8726 12.6784 2.3693 1.1662 13.5193 13.3836 20.5004 5.8187 6.3366 6.1341 3.0617 11.1718 4.2140 1.1933 5.5674 0.4908 3.7270 3.9984 19.0687 24.0272
temp: 298.150 k
press: 1.00000 atm
elementType: 16 16 8 8 8 8 6 6 6 6 6 6 6 6 6 6 6 1 1 1 1 1 1 1 1 1 1 1 1 1 1 1 1
symmnumber: 1
zpe: 656782.6 jmol-1
zpe.correction: 0.250155 hartree
zpe.thermalcorrener: 0.270587 hartree
zpe.thermalcorrenthalpy: 0.271531 hartree
zpe.thermalcorrgfe: 0.199364 hartree
zpe.sumelectzpe: -1524.154539 hartree
zpe.sumelectthermal: -1524.134107 hartree
zpe.sumelectthermalent: -1524.133163 hartree
zpe.sumelectthermalfe: -1524.205330 hartree
dipole: -7.4535 -1.2261 2.9773
dipole: 8.1193
quadrupole: -111.1435 -122.2531 -115.7361
quadrupole: -4.7203 13.2550 -4.4812
quadrupole: 5.2341 -5.8756 0.6415 -4.7203 13.2550 -4.4812
hfenergy: -1524.4046939 hartree
pointgroup: C01 [X(C11H16O4S2)]
dipole: 1.8941578 -2.4552943 -0.7665881 debye
polarizability: 198.8978321|-16.2631039|224.6541178|-0.8740209|-13.723778|165.4510556 unknown
InChI: InChI=1S/C11H16O4S2/c1-3-16(12,13)11(17(14,15)4-2)10-8-6-5-7-9-10/h5-9,11H,3-4H2,1-2H3
charge 0 multiplicity 1
33 atoms
S  -2.052772 0.735341 1.09821
S  0.941802 1.469448 -0.05265
O  -2.692812 -0.400151 2.085248
O  -2.274307 2.314835 1.425068
O  0.990401 2.994201 0.517051
O  0.317731 1.162391 -1.547717
C  -0.024791 0.331146 1.225133
C  0.246568 -1.117062 1.098658
C  -2.628701 0.371282 -0.745011
C  2.788656 0.793421 -0.057545
C  0.397279 -1.882618 2.28979
C  0.299062 -1.77576 -0.165554
C  -3.9065 1.161454 -0.999849
C  3.632235 1.797619 -0.834124
C  0.612358 -3.274566 2.218816
C  0.521479 -3.165671 -0.226311
C  0.67865 -3.919372 0.96208
H  0.1803 0.790668 2.20667
H  -1.759209 0.694791 -1.344659
H  -2.748328 -0.723166 -0.73518
H  3.043487 0.720152 1.012386
H  2.700986 -0.20085 -0.519789
H  0.32708 -1.386673 3.263911
H  0.174939 -1.191848 -1.086003
H  -4.194472 1.02286 -2.059166
H  -4.742649 0.820722 -0.366246
H  -3.745892 2.238986 -0.826571
H  4.689264 1.473032 -0.810441
H  3.314003 1.861107 -1.888564
H  3.568423 2.802752 -0.383182
H  0.719742 -3.855228 3.14096
H  0.566785 -3.665181 -1.200128
H  0.844907 -5.000764 0.908609
