program: Gaussian 09
title: 000270317
version: EM64L-G09RevD.01
frameworkgroup: C1[X(C13H28O4S2)]
method: RPBEPBE
basis: SDD
operation: Freq
keyword: #p
keyword: freq=noraman
keyword: PBEPBE/SDD
title: #p freq=noraman PBEPBE/SDD
converged: YES YES NO NO
title: Mulliken charges:
elementType: S S O O O O C C C C C C C C C C C C C H H H H H H H H H H H H H H H H H H H H H H H H H H H H
charge: 0.919802 0.899582 -0.556432 -0.538753 -0.561059 -0.568346 -0.363591 -0.408968 -0.401760 -0.337338 -0.344498 -0.498194 -0.485320 -0.352460 -0.352032 -0.646425 -0.637637 -0.699351 -0.697326 0.223219 0.295829 0.270901 0.287173 0.254068 0.192403 0.188553 0.203620 0.315151 0.282057 0.268154 0.253693 0.184081 0.214060 0.206183 0.209031 0.245541 0.259921 0.232029 0.257362 0.259775 0.231646 0.224946 0.206992 0.218425 0.210491 0.225337 0.209462
chargesum: 0.00000
title: Mulliken charges with hydrogens summed into heavy atoms:
elementType: S S O O O O C C C C C C C C C C C C C
charge: 0.919802 0.899582 -0.556432 -0.538753 -0.561059 -0.568346 -0.363591 0.110080 0.156314 0.109134 0.047676 0.099014 0.036528 0.045680 0.063183 0.091067 0.111147 -0.048988 -0.052036
polarizability: 2.29546285e+02 7.42229836e+00 2.27406447e+02 -7.40968325e+00 -1.14084663e+01 1.98210840e+02
1716.lowfreq: -13.2189 -0.0018 -0.0013 0.0009 4.0768 6.7021 21.8037 27.1189 33.5215
frequency: 20.9056 26.7942 33.0003 40.1799 51.1575 54.2215 62.3884 77.8434 80.4193 86.1458 101.1663 114.2785 128.8333 144.2303 153.4775 166.2054 179.7760 184.0459 189.3564 208.1561 212.6132 219.0205 227.9593 230.9237 232.0368 238.0033 249.1591 265.8806 274.4792 291.7217 330.3688 333.3047 340.4317 404.5806 445.6506 458.1107 471.1168 487.7057 516.3713 566.1918 589.9243 729.9127 732.5486 775.1538 780.1396 782.5721 787.8572 793.8194 799.5638 862.5445 891.9195 893.2612 898.5647 901.3962 925.2703 946.5773 968.9063 969.9441 1011.2574 1024.1667 1032.1009 1057.1954 1061.8532 1066.2707 1069.0234 1069.9541 1090.2132 1099.0366 1114.5355 1138.0529 1206.2479 1217.6601 1225.3233 1232.1154 1234.9184 1243.5450 1257.7521 1262.5379 1269.2458 1290.2394 1293.8978 1294.7631 1312.8324 1331.3447 1343.3127 1350.7852 1358.2255 1390.9407 1391.3100 1393.8096 1394.5788 1417.7686 1427.3033 1433.8235 1439.3914 1456.0418 1457.2047 1458.1349 1467.3031 1473.5050 1474.6025 1477.0633 1478.0852 1480.0796 1482.0374 1485.4897 1487.7229 2955.5487 2963.3633 2964.1844 2971.3058 2974.1439 2976.1230 2980.2336 2990.3914 2990.6465 2992.8681 3009.8546 3016.2455 3020.0042 3025.5284 3041.5795 3044.0783 3049.1136 3061.6211 3070.9343 3073.3397 3076.9745 3079.0352 3084.0243 3087.7367 3105.9863 3107.0066 3145.4096 3147.5927
redmass: 3.6930 2.7633 3.0780 3.5933 4.0346 2.9904 1.8386 2.4310 1.8586 3.7699 3.3076 3.3758 3.6595 4.6439 2.7250 3.8546 2.3631 1.4080 1.8776 4.4056 3.4931 3.1659 1.8849 1.4068 1.8525 3.8158 2.0766 2.4413 2.8913 2.6435 7.9034 5.1636 4.6238 3.1413 4.7636 3.9678 4.3456 7.1586 6.0339 4.0959 3.9169 1.1306 1.1034 1.2333 1.3947 1.2663 6.9484 2.1669 2.3179 3.0218 3.5505 1.8010 2.1554 5.1000 1.3466 1.3557 1.5249 1.5427 3.8090 2.3760 1.6508 1.3927 2.7020 2.5288 2.5959 2.6316 1.7330 1.9205 1.9295 1.7885 1.9106 1.3364 1.2418 1.2965 1.2723 1.7517 1.3577 1.2416 1.2499 1.1628 1.2548 1.1135 1.0959 1.3315 1.4247 1.3984 1.4431 1.2135 1.2108 1.1762 1.1808 1.1122 1.1095 1.0830 1.0806 1.0360 1.0358 1.0761 1.0712 1.0582 1.0598 1.0496 1.0427 1.0537 1.0513 1.0783 1.0765 1.0599 1.0607 1.0598 1.0571 1.0394 1.0365 1.0592 1.0640 1.0371 1.0364 1.0975 1.0949 1.0972 1.0997 1.0612 1.1028 1.0568 1.1021 1.1014 1.1006 1.0990 1.1003 1.0961 1.0967 1.1016 1.1019 1.1101 1.1076
irintensity: 0.5555 0.0426 0.7571 1.6127 1.3390 0.6623 0.7226 1.5096 0.0563 6.0186 1.5104 0.3779 0.3545 1.2316 0.7703 1.0072 0.7859 0.3377 1.0748 13.3331 4.1321 3.5120 11.6186 0.5181 7.6519 27.6795 0.7615 6.1766 4.3857 1.7223 10.6821 8.2642 12.4611 5.8371 48.7970 9.0065 6.0261 7.2442 19.2259 28.7286 3.7283 13.9322 10.3000 4.6110 6.5817 5.4215 41.9408 26.7949 29.4580 1.8090 17.0413 26.0318 21.8591 79.8518 9.4360 11.0163 57.5261 20.3457 2.6873 3.7901 2.8456 1.8332 10.8340 4.9875 6.0819 0.6420 20.0304 9.8864 17.4939 21.3970 3.4430 4.6299 0.4068 3.5685 8.6339 3.5308 11.8079 8.0788 6.8655 2.6448 8.0614 1.6945 2.8653 14.8942 7.1788 7.1165 0.7535 14.2373 11.9325 28.9718 31.1672 1.0029 9.1910 5.6990 32.8987 18.0742 18.3998 2.1846 0.4557 3.4413 6.8555 12.1662 12.2447 11.4731 12.6923 19.4746 6.6607 6.9306 21.2492 20.5727 4.4615 31.9228 33.6544 44.4506 26.4684 15.4236 13.1471 3.7743 9.9510 0.3812 4.7052 1.2543 14.4746 5.4351 1.7520 83.7373 57.1825 41.6871 50.9036 6.1998 6.6895 8.3238 3.3490 5.3637 0.7160
temp: 298.150 k
press: 1.00000 atm
elementType: 16 16 8 8 8 8 6 6 6 6 6 6 6 6 6 6 6 6 6 1 1 1 1 1 1 1 1 1 1 1 1 1 1 1 1 1 1 1 1 1 1 1 1 1 1 1 1
symmnumber: 1
zpe: 1031525.3 jmol-1
zpe.correction: 0.392887 hartree
zpe.thermalcorrener: 0.420129 hartree
zpe.thermalcorrenthalpy: 0.421073 hartree
zpe.thermalcorrgfe: 0.333334 hartree
zpe.sumelectzpe: -1607.313387 hartree
zpe.sumelectthermal: -1607.286146 hartree
zpe.sumelectthermalent: -1607.285202 hartree
zpe.sumelectthermalfe: -1607.372941 hartree
dipole: 4.2179 3.9355 -1.4105
dipole: 5.9387
quadrupole: -128.5898 -142.0475 -135.0086
quadrupole: 2.7110 -8.5578 -4.9786
quadrupole: 6.6255 -6.8322 0.2067 2.7110 -8.5578 -4.9786
hfenergy: -1607.7062747 hartree
pointgroup: C01 [X(C13H28O4S2)]
dipole: -2.2253846 -0.0342464 0.7110873 debye
polarizability: 234.0310653|2.7419563|219.2864009|-15.2725946|6.8030776|201.8461061 unknown
InChI: InChI=1S/C13H28O4S2/c1-5-9-11-13(12-10-6-2,18(14,15)7-3)19(16,17)8-4/h5-12H2,1-4H3
charge 0 multiplicity 1
47 atoms
S  1.997024 0.054122 -0.723673
S  -0.127283 1.717455 1.025193
O  1.863633 -0.51656 -2.258689
O  2.922985 -0.778075 0.33819
O  1.238901 1.911304 1.916122
O  -0.538616 2.872696 -0.070502
C  0.031851 -0.006349 0.009753
C  0.030597 -1.164326 0.989291
C  -0.865587 0.046783 -1.204786
C  0.153875 -2.556556 0.311325
C  -2.363901 -0.253026 -0.939227
C  2.66526 1.900053 -0.843792
C  -1.589472 1.583701 2.329247
C  0.135555 -3.689485 1.36177
C  -3.160047 -0.336708 -2.262721
C  3.774912 1.92293 -1.885691
C  -1.801969 2.978102 2.909317
C  0.262783 -5.086877 0.71919
C  -4.662687 -0.602677 -2.034065
H  -0.909151 -1.140713 1.581665
H  0.880276 -1.040508 1.691142
H  -0.778705 1.046858 -1.67372
H  -0.455617 -0.674775 -1.941734
H  1.101276 -2.605568 -0.255559
H  -0.67093 -2.707804 -0.412436
H  -2.805935 0.550499 -0.315511
H  -2.480164 -1.204225 -0.383187
H  2.962604 2.094524 0.196883
H  1.770625 2.489522 -1.107382
H  -1.212104 0.84438 3.052645
H  -2.443632 1.195324 1.753114
H  -0.802321 -3.635644 1.953406
H  0.969305 -3.532967 2.074709
H  -2.729302 -1.138744 -2.895053
H  -3.028975 0.609035 -2.824804
H  4.641404 1.315359 -1.574801
H  3.417405 1.556943 -2.863119
H  4.112648 2.969647 -2.008182
H  -0.894523 3.336618 3.424242
H  -2.072522 3.700436 2.120561
H  -2.62599 2.939933 3.646188
H  1.207344 -5.174495 0.151437
H  -0.570353 -5.282547 0.017901
H  0.253744 -5.883124 1.485603
H  -5.124372 0.205729 -1.436139
H  -5.208349 -0.664584 -2.992842
H  -4.822002 -1.55502 -1.493779
