program: Gaussian 09
title: 000270316
version: EM64L-G09RevD.01
frameworkgroup: C1[X(C24H26O4S2)]
method: RPBEPBE
basis: SDD
operation: Freq
keyword: #p
keyword: freq=noraman
keyword: PBEPBE/SDD
title: #p freq=noraman PBEPBE/SDD
converged: YES YES NO NO
title: Mulliken charges:
elementType: S S O O O O C C C C C C C C C C C C C C C C C C C C C C C C H H H H H H H H H H H H H H H H H H H H H H H H H H
charge: 0.892474 0.906623 -0.561145 -0.552627 -0.537009 -0.556921 -0.600998 -0.367739 -0.349854 -0.743076 -0.788920 -0.555898 0.529727 0.557573 0.504247 -0.346241 -0.357486 -0.342896 -0.366418 -0.387727 -0.446650 -0.216619 -0.216746 -0.217563 -0.224139 -0.222531 -0.222923 -0.235034 -0.224243 -0.244536 0.352746 0.225910 0.274704 0.270734 0.215008 0.272226 0.267070 0.295330 0.330281 0.220781 0.192739 0.244620 0.238216 0.241738 0.300010 0.248899 0.227219 0.235256 0.231851 0.235104 0.234250 0.236190 0.232249 0.224196 0.221794 0.226177
chargesum: 0.00000
title: Mulliken charges with hydrogens summed into heavy atoms:
elementType: S S O O O O C C C C C C C C C C C C C C C C C C C C C C C C
charge: 0.892474 0.906623 -0.561145 -0.552627 -0.537009 -0.556921 -0.248253 0.132875 0.135888 -0.203780 -0.163310 -0.142378 0.529727 0.557573 0.504247 -0.101621 -0.119271 -0.101158 -0.066408 -0.138828 -0.219431 0.018637 0.015105 0.017541 0.010110 0.013659 0.009326 -0.010838 -0.002449 -0.018359
polarizability: 4.04030282e+02 5.79741372e+01 3.34825267e+02 -1.83720546e+01 2.92082378e+01 3.30172652e+02
1716.lowfreq: -8.6883 -2.4755 -0.0016 -0.0007 0.0005 5.1037 8.5083 14.8532 16.4864
frequency: -3.8834 14.6204 15.5466 21.4618 25.3074 26.7969 32.2071 40.3569 52.0509 53.5015 65.0614 71.3883 90.0597 110.0587 119.8595 128.9820 150.0161 164.5942 171.9890 176.7658 183.3889 194.2342 196.1396 214.8965 227.9324 292.5749 310.3371 322.1883 323.1828 341.0221 342.8042 349.4202 356.9035 399.6047 401.4678 404.1599 406.7060 421.0582 478.6929 497.7284 506.4896 518.5366 521.4403 565.1518 569.5400 584.6540 615.0605 615.6250 616.6379 622.1909 691.4441 693.2863 705.4196 727.1070 758.3863 771.0298 776.4521 791.5215 799.0321 807.5706 814.5600 818.3058 835.9671 844.1884 851.9839 854.8914 856.0955 889.9298 904.5317 912.5778 922.4984 929.0117 943.7400 954.2391 976.2578 979.9892 985.7089 988.6286 989.8110 990.4874 994.1185 1002.5475 1006.8017 1022.0007 1026.6041 1027.1636 1029.0621 1042.0405 1060.5759 1061.9600 1079.0233 1094.8145 1100.6294 1110.1022 1113.7994 1146.8484 1153.5616 1171.2663 1176.2492 1177.6925 1187.8327 1189.7108 1193.8662 1194.9904 1204.3428 1217.5417 1240.6540 1249.1387 1262.5008 1270.7004 1297.9890 1324.7499 1331.9355 1334.6848 1337.7755 1362.8732 1382.9969 1391.2003 1391.3086 1424.3294 1429.4804 1440.7133 1444.2540 1444.4618 1457.4311 1460.1573 1479.2538 1484.6570 1484.7044 1487.3829 1582.8202 1586.2936 1593.3573 1609.6723 1609.8255 1614.7481 2945.7256 2970.0665 2994.1262 3009.5905 3024.0142 3037.3457 3062.2973 3077.9547 3090.3395 3111.8882 3117.0326 3125.5750 3128.2089 3130.3901 3132.4567 3137.5106 3137.6553 3139.6006 3142.2451 3146.7446 3153.1921 3157.8735 3159.0637 3160.8872 3167.2325 3172.0697
redmass: 5.7064 5.9021 4.1540 5.1941 4.2530 6.1671 4.0281 5.2066 5.3922 4.0790 6.3775 5.2021 5.6512 4.1098 6.2759 4.2845 4.4043 5.7943 6.7177 6.8234 7.4205 8.5502 6.5068 4.1559 5.7764 3.5061 7.0227 4.8374 4.8436 5.5908 2.1434 2.7747 2.4542 3.0711 2.7686 2.8256 7.0567 8.5524 4.7960 3.8065 4.2386 4.7437 5.5884 4.4843 4.6094 5.0126 6.3018 6.3001 6.2100 5.2019 1.6977 1.7080 1.7740 1.1688 1.8184 2.1134 1.9170 8.7709 12.1107 4.1053 4.2739 4.3454 1.4049 1.4267 1.8249 1.2938 1.2692 1.7267 3.7676 1.7832 2.0680 1.4256 1.4565 2.8102 1.3857 1.3978 2.6170 5.9520 6.0350 1.9355 1.3184 1.3444 1.3663 2.4356 2.1849 2.1909 2.0592 2.5635 1.3137 1.2870 1.3671 2.9399 1.3669 1.2624 1.2247 1.1678 1.1799 1.0523 1.0554 1.0547 1.2462 1.2289 1.1150 1.1350 1.1404 2.3738 2.7865 2.7884 1.2908 1.3072 1.1133 1.3263 1.2778 1.3349 1.2734 1.3944 7.2621 8.7962 8.7516 1.1218 1.1272 2.1638 2.2724 2.2381 1.0931 1.1658 1.1402 2.3363 2.1608 2.3084 5.6848 5.8376 6.0292 5.9138 5.8116 6.1149 1.0605 1.0589 1.0922 1.0748 1.0954 1.0595 1.0562 1.0877 1.0994 1.0868 1.0871 1.0874 1.0894 1.0910 1.0853 1.0924 1.0884 1.1122 1.0959 1.0928 1.0961 1.1110 1.0989 1.1015 1.1014 1.1018
irintensity: 0.5058 1.3291 0.1832 0.1603 0.1045 0.8382 0.1066 1.5964 0.9670 0.4270 2.7375 0.6598 3.9954 1.2307 1.3728 7.8858 6.9576 0.7603 11.6189 3.1178 21.7248 15.4221 1.4967 4.6859 2.0733 0.6931 25.3970 25.1350 5.5851 39.9321 1.4473 0.7286 6.2336 2.9464 0.0305 0.0411 10.8071 9.4502 50.4899 89.9566 37.5980 34.7404 24.2195 8.3832 13.8878 3.8311 1.2829 0.0093 0.6765 11.7438 42.7880 61.3335 50.3091 4.9832 44.8683 12.0717 20.9937 56.0053 67.9603 3.5239 4.1385 4.8455 1.9378 2.6507 19.6191 4.3885 0.5054 27.3298 45.0559 8.5512 40.5365 0.7632 2.4061 32.1996 0.0669 0.1225 0.0787 1.6209 0.1126 0.9503 0.2590 0.0611 0.3460 0.7504 3.9118 2.5253 8.3704 3.3627 12.3223 19.3397 5.3260 6.9471 25.0105 1.7437 1.8341 26.7940 12.7539 0.0022 0.2002 0.1115 9.4250 10.1244 14.0741 18.6682 7.9563 0.0389 33.2186 67.1163 6.0558 1.6489 4.6629 7.2210 0.6467 5.6875 1.1359 2.0664 0.0841 0.8994 2.1313 15.1688 2.5426 5.8379 15.2598 13.0996 2.1446 5.0436 12.5046 3.1175 17.2119 2.1500 0.2538 0.4100 1.3355 17.7818 19.6118 9.2449 13.8188 32.1197 4.7413 9.2084 19.7841 14.9846 11.8219 1.6088 6.9456 9.0877 3.4998 4.0995 4.0733 12.5632 1.0591 5.1448 0.1066 16.1911 40.9375 12.8308 18.4449 0.8260 22.7193 24.3260 41.2637 24.4761
temp: 298.150 k
press: 1.00000 atm
elementType: 16 16 8 8 8 8 6 6 6 6 6 6 6 6 6 6 6 6 6 6 6 6 6 6 6 6 6 6 6 6 1 1 1 1 1 1 1 1 1 1 1 1 1 1 1 1 1 1 1 1 1 1 1 1 1 1
symmnumber: 1
zpe: 1147956.4 jmol-1
zpe.correction: 0.437234 hartree
zpe.thermalcorrener: 0.467333 hartree
zpe.thermalcorrenthalpy: 0.468277 hartree
zpe.thermalcorrgfe: 0.370727 hartree
zpe.sumelectzpe: -2024.671294 hartree
zpe.sumelectthermal: -2024.641195 hartree
zpe.sumelectthermalent: -2024.640251 hartree
zpe.sumelectthermalfe: -2024.737801 hartree
dipole: 3.7958 3.5672 2.0507
dipole: 5.5981
quadrupole: -176.0374 -189.5480 -188.1764
quadrupole: 12.8904 -13.4311 -10.9676
quadrupole: 8.5499 -4.9607 -3.5892 12.8904 -13.4311 -10.9676
hfenergy: -2025.1085279 hartree
pointgroup: C01 [X(C24H26O4S2)]
dipole: -1.6640593 1.0237757 1.0166464 debye
polarizability: 372.7564282|-73.0905671|353.2773382|-20.3807725|-16.6296147|342.9944334 unknown
InChI: InChI=1S/C24H26O4S2/c25-29(26,19-22-13-6-2-7-14-22)24(18-10-17-21-11-4-1-5-12-21)30(27,28)20-23-15-8-3-9-16-23/h1-9,11-16,24H,10,17-20H2
charge 0 multiplicity 1
56 atoms
S  -0.074117 1.787813 -1.156428
S  2.120817 -0.304338 -2.439935
O  0.975452 2.992583 -1.55355
O  0.039164 1.128032 0.338252
O  1.994273 -1.84032 -1.894495
O  2.593323 -0.066595 -3.991861
C  0.213127 0.430899 -2.522934
C  -0.787656 -0.709894 -2.558583
C  -1.081962 -1.439064 -1.223875
C  -1.99871 2.519133 -1.405364
C  3.394339 0.838147 -1.188855
C  -1.903495 -2.730238 -1.478632
C  -2.231049 3.529002 -0.354825
C  3.788311 0.038513 -0.02075
C  -2.210023 -3.487163 -0.193757
C  -1.906734 4.895806 -0.587045
C  4.954123 -0.779606 -0.076806
C  -2.741595 3.139122 0.915779
C  3.015764 0.070854 1.177077
C  -1.168942 -4.143067 0.515378
C  -3.524535 -3.538898 0.334578
C  -2.11443 5.855651 0.423528
C  5.356529 -1.526152 1.047338
C  -2.947269 4.102346 1.923489
C  3.422945 -0.679268 2.298187
C  -2.637454 5.461848 1.678779
C  4.592694 -1.474627 2.238812
C  -1.436393 -4.831842 1.718457
C  -3.796966 -4.226053 1.540638
C  -2.752504 -4.875351 2.237087
H  0.307691 1.036586 -3.440757
H  -1.735025 -0.335185 -3.004179
H  -0.386203 -1.44926 -3.284013
H  -0.129855 -1.701921 -0.733867
H  -1.630307 -0.781377 -0.523252
H  -1.926103 2.896946 -2.435773
H  -2.579026 1.589121 -1.318557
H  4.160894 1.003738 -1.961444
H  2.754095 1.719507 -1.025242
H  -1.321687 -3.376518 -2.166257
H  -2.848667 -2.474511 -1.998879
H  -1.486953 5.19592 -1.553708
H  5.539786 -0.822597 -1.003009
H  -2.96515 2.083875 1.108774
H  2.094857 0.665347 1.209548
H  -0.146041 -4.114192 0.119038
H  -4.341105 -3.042033 -0.204923
H  -1.864702 6.905798 0.239228
H  6.256558 -2.148466 0.999292
H  -3.341109 3.79732 2.898686
H  2.827173 -0.650205 3.216835
H  -2.797378 6.209294 2.463736
H  4.904987 -2.056307 3.113625
H  -0.621403 -5.336143 2.250251
H  -4.820332 -4.258354 1.932218
H  -2.960727 -5.411657 3.169849
