program: Gaussian 09
title: 000270306
version: EM64L-G09RevD.01
frameworkgroup: C1[X(C16H20N2O3)]
method: RPBEPBE
basis: SDD
operation: Freq
keyword: #p
keyword: freq=noraman
keyword: PBEPBE/SDD
title: #p freq=noraman PBEPBE/SDD
converged: YES YES NO NO
title: Mulliken charges:
elementType: O O O N N C C C C C C C C C C C C C C C C H H H H H H H H H H H H H H H H H H H H
charge: -0.412445 -0.230792 -0.438131 -0.343352 -0.476055 -0.206821 0.182180 0.134453 -0.208719 -0.536255 -0.400116 0.172084 -0.354796 0.193886 0.136060 -0.401667 -0.427023 -0.373952 -0.255710 -0.331893 -0.223124 0.221643 0.270557 0.236104 0.231382 0.220808 0.189851 0.295176 0.300031 0.237711 0.180972 0.189152 0.212764 0.232169 0.229754 0.219707 0.214597 0.187727 0.220763 0.381876 0.329444
chargesum: 0.00000
title: Mulliken charges with hydrogens summed into heavy atoms:
elementType: O O O N N C C C C C C C C C C C C C C C C
charge: -0.030569 -0.230792 -0.108688 -0.048176 -0.176023 0.014822 0.182180 0.134453 0.061838 -0.068769 0.010544 0.172084 0.063886 0.193886 0.136060 0.000249 -0.194854 -0.144198 -0.036003 0.070430 -0.002362
polarizability: 2.57057187e+02 -1.82959049e+01 2.03679828e+02 2.28663233e+01 8.47118191e+00 1.32644791e+02
1716.lowfreq: -5.2412 -1.5891 -0.0003 -0.0002 0.0004 5.0136 22.4224 31.7224 38.6859
frequency: 22.3970 31.6737 38.6303 44.1938 51.9666 83.0273 100.6760 106.6409 128.5802 136.5838 163.2748 173.3837 208.0714 230.5974 260.2458 283.9080 313.1757 318.7318 326.4450 364.2531 413.7654 439.4988 446.2607 486.1207 493.3901 498.0847 518.7902 566.6794 576.4707 578.7371 603.3164 619.0085 622.5339 654.4377 699.2397 731.9106 745.4081 750.3233 756.6179 762.3656 792.7648 822.7315 849.6876 869.2690 882.3600 928.3384 930.3654 934.4950 960.2310 969.6827 974.0595 992.3060 1011.5135 1031.7909 1041.9994 1051.1320 1067.7213 1086.5606 1095.8125 1109.8978 1121.8554 1144.5963 1151.0687 1169.8811 1183.6770 1213.4115 1217.0232 1224.1222 1235.0602 1238.5534 1266.1508 1280.0804 1281.3123 1286.8088 1292.6379 1307.2045 1310.4806 1329.9264 1337.9604 1351.0938 1353.3762 1356.1732 1380.8842 1408.7971 1436.4057 1452.2953 1457.0859 1462.6630 1465.8905 1469.2976 1473.7860 1481.0909 1485.9497 1578.0550 1592.2321 1631.9997 1662.3314 2948.2805 2953.1071 2956.3887 2960.1944 2961.5894 2967.4707 3010.4405 3021.0342 3022.4863 3038.8430 3045.1384 3071.4256 3122.2326 3129.3045 3143.4527 3161.7539 3474.6954 3507.6119 3558.4360 3606.0427
redmass: 6.1059 3.1267 4.5523 2.6825 4.4536 4.3373 4.8377 6.0540 2.7932 2.0943 3.3518 3.8817 4.2897 4.5332 6.7307 4.1016 1.8206 3.9187 1.8647 3.2296 3.1510 4.4508 3.7351 2.2235 1.3879 2.7460 2.9154 3.2957 5.3450 3.1451 1.5269 2.5902 2.9940 4.2869 3.8962 2.0310 1.3960 1.5601 4.1345 4.4063 1.3154 3.2351 1.4754 3.9074 1.7946 1.7761 2.0337 2.4710 3.1159 1.3002 3.7478 3.2694 2.0290 2.8406 3.4452 2.9778 1.8735 1.9721 1.7641 1.7263 1.9594 2.1453 2.2160 1.2520 1.3225 1.4787 1.3872 1.4165 1.4729 1.7345 1.5275 1.5740 1.0922 1.2076 1.6719 1.1880 1.3894 1.7517 1.4167 1.7605 1.8069 1.7349 1.2502 4.3538 3.0075 1.1488 1.1883 1.0719 1.4623 2.5130 1.0985 2.9152 1.0982 7.0374 6.5495 7.0495 8.6176 1.0687 1.0638 1.0820 1.0635 1.0616 1.0627 1.0933 1.0923 1.0967 1.0909 1.1009 1.0981 1.0849 1.0891 1.0951 1.1001 1.0755 1.0639 1.0661 1.0802
irintensity: 0.8073 0.4035 1.3860 3.6728 0.4613 1.0543 0.8815 1.6183 6.7724 1.4152 1.1159 1.3717 0.8822 1.4385 2.3477 5.2816 48.5421 25.2747 89.9850 5.2978 16.2598 7.8061 11.0202 30.6724 65.2039 11.3962 19.3297 26.6926 11.6891 22.6465 75.7447 114.3083 32.9452 15.7578 30.5271 7.2902 39.6400 64.7458 5.4499 11.8789 1.7291 4.4000 0.0312 0.1819 8.7376 0.5120 10.5434 33.6896 41.3062 0.0133 10.8142 0.2003 9.6743 131.3716 38.7370 95.7385 14.1291 45.0055 40.9823 6.9388 15.2045 33.7347 19.0996 4.1398 14.9477 4.5009 4.9451 4.2455 14.3655 18.6708 1.6781 14.6274 2.7545 8.4570 16.0394 4.0197 14.9164 53.4960 26.6891 11.7972 24.8491 12.5180 25.2730 17.4104 7.4410 6.4429 15.0274 1.2592 10.1775 21.8441 1.9795 0.5617 13.9027 1.0840 6.0988 0.8080 224.7580 49.7827 2.7849 24.1026 31.9809 32.2192 75.7522 9.5425 9.3835 5.3517 21.8900 58.8846 62.2401 1.9793 3.4258 35.4260 35.3649 14.4128 25.4511 7.6998 42.9398
temp: 298.150 k
press: 1.00000 atm
elementType: 8 8 8 7 7 6 6 6 6 6 6 6 6 6 6 6 6 6 6 6 6 1 1 1 1 1 1 1 1 1 1 1 1 1 1 1 1 1 1 1 1
symmnumber: 1
zpe: 882265.5 jmol-1
zpe.correction: 0.336037 hartree
zpe.thermalcorrener: 0.356174 hartree
zpe.thermalcorrenthalpy: 0.357119 hartree
zpe.thermalcorrgfe: 0.284995 hartree
zpe.sumelectzpe: -955.320627 hartree
zpe.sumelectthermal: -955.300490 hartree
zpe.sumelectthermalent: -955.299546 hartree
zpe.sumelectthermalfe: -955.371670 hartree
dipole: 1.1723 0.1148 0.5641
dipole: 1.3060
quadrupole: -146.2893 -116.2604 -123.8727
quadrupole: -9.2299 -2.9375 11.9250
quadrupole: -17.4818 12.5470 4.9348 -9.2299 -2.9375 11.9250
hfenergy: -955.6566645 hartree
pointgroup: C01 [X(C16H20N2O3)]
dipole: 0.4599574 -0.0694165 -0.2182784 debye
polarizability: 259.5800805|15.1533065|201.2267595|-20.6283271|11.3313749|132.5749651 unknown
InChI: InChI=1S/C16H20N2O3/c19-8-4-3-7-13-15-11(9-14(17-13)16(20)21)10-5-1-2-6-12(10)18-15/h1-2,5-6,13-14,17-20H,3-4,7-9H2
charge 0 multiplicity 1
41 atoms
O  -0.93234 -4.051945 -1.365902
O  -1.432241 -3.970188 0.901924
O  -6.53112 2.601508 -0.953137
N  -1.199743 -1.176626 0.831696
N  1.328929 1.666069 0.667943
C  -0.839176 0.26312 0.905609
C  0.626925 0.451609 0.571876
C  1.485444 -0.536886 0.091003
C  -0.537031 -1.962138 -0.225978
C  1.035851 -1.957314 -0.141545
C  -1.763686 1.121817 -0.011604
C  2.783013 0.078368 -0.113371
C  -3.236614 1.099596 0.442759
C  2.65483 1.466657 0.256534
C  -1.031582 -3.396511 -0.134457
C  -4.173506 1.85525 -0.526435
C  4.038665 -0.396107 -0.575731
C  3.735255 2.370824 0.17953
C  5.120655 0.503049 -0.656347
C  -5.639321 1.846397 -0.056025
C  4.971192 1.871235 -0.282738
H  -1.029489 0.581411 1.952923
H  -0.816546 -1.554487 -1.213966
H  1.454067 -2.368679 -1.07992
H  1.367418 -2.621706 0.68332
H  -1.681249 0.743333 -1.049991
H  -1.390371 2.166907 -0.031556
H  -1.184541 -1.666604 1.734259
H  0.937916 2.549516 0.98764
H  -3.551539 0.042469 0.539076
H  -3.317194 1.549545 1.455511
H  -4.107781 1.391381 -1.534235
H  -3.846094 2.907916 -0.638288
H  4.166989 -1.445593 -0.86438
H  3.626628 3.423392 0.464865
H  6.095592 0.150284 -1.010921
H  -5.738163 2.359524 0.916005
H  -5.99613 0.800197 0.066609
H  5.831643 2.545682 -0.35637
H  -1.20807 -5.003018 -1.258095
H  -6.491485 2.193842 -1.855287
