program: Gaussian 09
title: 000270305
version: EM64L-G09RevD.01
frameworkgroup: C1[X(C11H11N)]
method: RPBEPBE
basis: SDD
operation: Freq
keyword: #pfreq=noraman
keyword: PBEPBE/SDD
title: #p freq=noraman PBEPBE/SDD
converged: NO NO NO NO
title: Mulliken charges:
elementType: N C C C C C C C C C C C H H H H H H H H H H H
charge: -0.460639 0.104549 0.118161 -0.526849 -0.502064 -0.425261 0.174698 0.235390 -0.414287 -0.372961 -0.253235 -0.223350 0.224883 0.224894 0.227554 0.227487 0.224585 0.224574 0.298681 0.231979 0.226391 0.216897 0.217926
chargesum: 0.00000
title: Mulliken charges with hydrogens summed into heavy atoms:
elementType: N C C C C C C C C C C C
charge: -0.161958 0.104549 0.118161 -0.077072 -0.047024 0.023898 0.174698 0.235390 -0.182308 -0.146570 -0.036339 -0.005425
polarizability: 1.79611800e+02 -6.28970306e+00 1.24762926e+02 -2.15936908e-03 2.51556560e-03 6.17589059e+01
1716.lowfreq: -93.8190 -0.0003 -0.0002 0.0002 2.6173 8.3836 22.0590 108.2200 157.6151
frequency: -93.7928 108.2189 157.6150 225.5928 272.3315 289.8362 426.4631 438.5829 495.9002 505.6735 572.0971 575.6317 621.0867 647.2206 704.2580 744.7276 747.5581 759.3906 774.9415 830.4542 849.0576 886.1711 916.8814 928.0508 948.6849 967.5562 1004.2290 1013.9536 1038.9753 1089.5733 1128.4436 1138.9792 1166.0122 1186.2785 1207.3933 1232.1120 1233.8942 1244.2414 1270.8901 1295.2673 1321.8659 1375.9834 1400.6969 1445.8710 1463.3500 1476.4313 1477.6324 1484.6280 1493.7194 1573.9738 1592.3523 1631.5557 2966.1226 2972.4222 3004.9611 3010.6562 3020.6218 3079.3165 3118.3748 3125.8980 3140.7488 3158.9827 3607.0196
redmass: 1.5831 3.9462 2.6470 4.0200 4.8102 3.7686 2.8781 5.5329 1.2345 3.9989 6.4953 3.3468 3.1186 6.3132 5.7478 1.5489 1.3462 1.9510 5.3346 5.0409 1.4367 3.1758 1.4000 1.3910 5.3257 1.2961 2.9442 2.3695 1.7028 3.7539 1.7341 1.1576 1.1113 1.1945 1.2365 2.0305 1.0740 1.4202 1.7022 1.4430 1.9119 3.1452 3.2227 3.2320 1.1345 3.4946 1.1840 2.7486 1.3125 6.5406 6.2194 6.9977 1.0585 1.0590 1.1031 1.1032 1.0613 1.1052 1.0849 1.0888 1.0951 1.1001 1.0805
irintensity: 0.4401 4.9253 0.0391 1.2094 0.0002 2.5297 9.0298 1.5883 84.2135 4.3486 0.9171 7.3231 14.4758 0.7437 0.6223 18.3297 101.4469 0.1939 0.3961 0.0428 0.0042 0.3155 0.0143 3.5251 0.4377 0.0061 4.0084 6.0742 0.0841 8.5735 7.9811 0.0421 0.3283 0.0906 6.6411 7.9823 0.0048 4.1898 4.3241 11.6432 34.2635 15.5995 16.4563 24.0828 0.9500 20.4767 6.6255 8.5741 4.5887 0.9201 16.3102 1.3517 78.1113 55.3625 24.0423 11.8072 85.9068 48.1678 2.2655 5.0905 38.4518 33.7561 48.5737
temp: 298.150 k
press: 1.00000 atm
elementType: 7 6 6 6 6 6 6 6 6 6 6 6 1 1 1 1 1 1 1 1 1 1 1
symmnumber: 1
zpe: 499963.7 jmol-1
zpe.correction: 0.190426 hartree
zpe.thermalcorrener: 0.198877 hartree
zpe.thermalcorrenthalpy: 0.199821 hartree
zpe.thermalcorrgfe: 0.156975 hartree
zpe.sumelectzpe: -479.681145 hartree
zpe.sumelectthermal: -479.672695 hartree
zpe.sumelectthermalent: -479.671751 hartree
zpe.sumelectthermalfe: -479.714596 hartree
dipole: 1.8715 -1.7961 -0.0015
dipole: 2.5940
quadrupole: -64.5155 -59.3441 -75.0017
quadrupole: -0.1311 -0.0014 0.0069
quadrupole: 1.7716 6.9430 -8.7146 -0.1311 -0.0014 0.0069
hfenergy: -479.8715716 hartree
pointgroup: C01 [X(C11H11N1)]
dipole: -0.7459094 -0.696489 -0.0047833 debye
dipolederiv: -0.5770318 0.1607856 -0.0042963 -0.2082796 -0.5628529 -0.0017297 -0.0031346 0.001586 -0.2759024 -0.2329382 -0.2182765 0.0001061 -0.2588732 -0.1201611 -0.0032786 0.0004088 -0.0026606 -0.160808 0.1837273 -0.2851906 0.0042406 0.0366299 0.4841285 -0.001819 0.0031925 -0.0053624 -0.0668438 0.0365155 -0.0614463 -0.0018432 -0.0757507 0.1380116 -0.0005231 -0.0018276 -0.0004157 0.221316 0.0724061 0.1272444 -0.0023042 0.0208262 -0.000573 0.0012496 -0.0019141 0.0023797 0.2175237 0.1347996 -0.0351222 -0.0000589 -0.0633605 0.0303463 -0.0001414 0.0000398 0.0001901 0.1561552 0.4248391 0.1599939 0.0040328 -0.2014644 -0.1945497 -0.0013396 0.0057584 0.0028974 0.0201301 0.1106706 0.1769131 0.0002297 0.666487 0.1495061 0.0074929 -0.0022694 0.0019385 0.0349091 0.0271039 -0.0118975 0.0023652 0.011192 0.0923282 -0.0011964 0.002292 -0.001483 -0.1775975 0.1261699 -0.0534297 0.0039356 -0.0246916 0.044189 -0.0014585 0.0038959 -0.0017817 -0.2010395 -0.0687205 0.0591487 0.0011422 0.1139701 0.0297151 0.0002012 0.0008713 -0.0004002 -0.1927486 -0.0961159 -0.0307018 0.0012824 -0.118248 0.0127217 -0.0023124 0.001739 -0.0013863 -0.1963799 0.0122478 0.0216788 -0.0043055 0.0496927 -0.0741729 -0.1059939 0.0493678 -0.1586169 -0.062716 0.0132104 0.0180376 0.0058932 0.046772 -0.0716864 0.1072129 -0.0480456 0.1591865 -0.066204 -0.065248 -0.069488 -0.0476249 -0.0560365 -0.0228575 -0.0926241 -0.1319171 -0.1344148 -0.0596855 -0.0694796 -0.0721709 0.0481158 -0.0570096 -0.0207944 0.0909645 0.1322364 0.1324241 -0.0575609 -0.0610505 0.0304981 0.0993995 0.0350305 0.0433046 -0.0292002 0.1673644 -0.0423021 -0.0619408 -0.0548794 0.0286071 -0.099516 0.0328258 0.0439795 0.0289833 -0.1675179 0.0419876 -0.0687943 0.1504144 0.022366 -0.0022675 0.0235623 0.1844533 0.0011346 -0.0020483 0.001755 0.3356147 0.0733253 0.0669632 -0.0012768 0.022869 -0.1052636 0.0015219 -0.0010603 0.0020518 0.156542 0.0638513 0.0215866 -0.0013829 0.0718137 -0.1220848 0.0022485 -0.0015929 0.0016537 0.1751468 -0.0605804 -0.116805 -0.0020218 -0.1273162 -0.0269432 -0.0005426 -0.0019638 -0.0004116 0.1645485 -0.1432366 0.0607055 -0.0038449 0.0593592 0.0692557 0.00115 -0.0038749 0.0011848 0.1663352 unknown
polarizability: 179.7584091|5.5395453|124.5995759|1.3444901|-0.2351394|61.7756464 unknown
InChI: InChI=1S/C11H11N/c1-2-6-10-8(4-1)9-5-3-7-11(9)12-10/h1-2,4,6,12H,3,5,7H2
charge 0 multiplicity 1
23 atoms
N  -0.306395 -1.646371 -0.002234
C  -0.952103 0.546612 -0.019789
C  -1.39556 -0.767813 -0.018812
C  -2.107291 1.519244 -0.037898
C  -2.889274 -0.931178 -0.035684
C  -3.376747 0.573426 -0.048254
C  0.492982 0.521966 -0.002733
C  0.87388 -0.876909 0.008332
C  1.517932 1.507356 0.004327
C  2.223189 -1.290221 0.0258
C  2.865201 1.096916 0.021757
C  3.215039 -0.2869 0.032386
H  -2.114041 2.18647 0.846392
H  -2.093496 2.178231 -0.928265
H  -3.250859 -1.482302 -0.926671
H  -3.271846 -1.474115 0.851568
H  -4.013629 0.774226 0.830789
H  -3.993064 0.766033 -0.943649
H  -0.346123 -2.663149 0.003424
H  1.259556 2.572614 -0.00381
H  2.496068 -2.352167 0.033948
H  3.6641 1.847189 0.027293
H  4.273181 -0.572055 0.045881
