program: Gaussian 09
title: 000270289
version: EM64L-G09RevD.01
frameworkgroup: C1[X(C14H14N2O3)]
method: RPBEPBE
basis: SDD
operation: Freq
keyword: #p
keyword: freq=noraman
keyword: PBEPBE/SDD
title: #p freq=noraman PBEPBE/SDD
converged: YES YES NO NO
title: Mulliken charges:
elementType: O O O N N C C C C C C C C C C C C C C H H H H H H H H H H H H H H
charge: -0.271312 -0.221930 -0.230893 -0.380236 -0.384414 -0.009307 -0.509614 0.026564 -0.393246 0.246341 0.104601 -0.685548 0.152016 0.507690 -0.333486 -0.326508 -0.219383 -0.219479 -0.238798 0.241142 0.249491 0.248601 0.224822 0.214492 0.359815 0.239587 0.209025 0.222674 0.250402 0.245505 0.226771 0.226528 0.228087
chargesum: 0.00000
title: Mulliken charges with hydrogens summed into heavy atoms:
elementType: O O O N N C C C C C C C C C C C C C C
charge: -0.271312 -0.221930 -0.230893 -0.380236 -0.024599 0.231835 -0.011522 0.026564 0.046068 0.246341 0.104601 -0.014262 0.152016 0.507690 -0.083084 -0.081003 0.007388 0.007049 -0.010711
polarizability: 2.51150179e+02 -4.71862888e+00 1.56233093e+02 6.83658239e+00 1.07672148e+01 1.12190841e+02
1716.lowfreq: -10.9689 -5.9210 -0.0010 -0.0009 -0.0005 5.0368 12.0343 41.3610 47.6452
frequency: 10.9572 41.3512 47.6392 73.6950 93.8088 101.6965 143.8297 164.2926 201.8616 223.2008 226.4166 257.0197 261.8111 278.7501 350.0708 406.6776 409.7663 420.0366 441.8876 471.8880 503.3861 545.2622 574.4157 596.5764 613.7404 631.8112 655.2053 691.9378 695.1797 705.3320 724.2025 733.2252 736.9894 770.3672 804.6736 835.6021 851.2838 884.9021 911.6555 954.4742 966.5607 985.0019 990.6093 992.0717 1006.0208 1028.9966 1045.4172 1057.1750 1086.2276 1089.3559 1114.6519 1130.2383 1172.1816 1177.2321 1186.4871 1190.6401 1242.6144 1257.2830 1273.4727 1286.0717 1291.7943 1311.4279 1317.4224 1361.7922 1365.3499 1385.9615 1393.5250 1439.9104 1451.9538 1476.0545 1476.7371 1481.9837 1487.5470 1507.8115 1598.5421 1609.9734 1616.1648 1657.8728 1672.7638 2980.9447 2986.7348 2997.1315 3027.5942 3043.4096 3059.5518 3081.3856 3096.5937 3129.5146 3141.7892 3155.9723 3168.0633 3176.0370 3566.6164
redmass: 3.7866 3.8717 6.8262 4.3865 2.6369 3.8547 5.9425 3.0958 4.5342 1.3091 4.9515 5.7217 3.5145 5.4867 5.6999 2.8263 5.5769 5.4310 3.1235 6.2242 3.8434 6.7317 5.8331 1.2619 5.6563 9.2501 5.8401 2.7255 2.5819 5.7231 3.8052 3.8727 6.3434 2.1281 1.4840 1.2640 4.2930 2.6305 1.4499 1.3477 1.4012 6.3871 1.3322 6.1698 3.6828 2.0987 4.9666 1.6863 1.7659 1.7478 1.6010 3.8690 1.0508 2.5348 1.2728 1.7198 1.8378 1.2973 1.7183 1.4148 3.3158 1.3770 1.3102 1.6953 4.2817 10.0596 1.2065 2.2580 1.0776 1.0436 1.1059 2.3383 1.0547 4.5087 6.5867 6.2090 8.2212 9.1198 9.5270 1.0598 1.0380 1.0610 1.0938 1.0992 1.0977 1.0991 1.1003 1.0850 1.0893 1.0942 1.0967 1.0999 1.0782
irintensity: 0.1815 0.4502 2.5072 1.5964 0.4065 1.0243 2.0414 0.1779 0.2466 0.9825 1.7891 12.3717 7.8161 3.9598 3.5854 0.5727 0.9814 1.0520 5.1782 9.6535 9.7636 32.1880 1.9222 91.8940 6.1440 3.4656 46.6169 32.9113 16.9553 8.4949 9.5252 14.6103 29.6790 35.1775 20.8780 0.0753 22.8197 82.9328 3.8895 10.5638 0.5834 28.1628 0.3273 0.4415 2.0615 34.8015 61.1311 9.1860 13.7546 11.0583 9.2224 75.6073 0.0415 8.4581 2.2104 5.3941 23.2758 1.9778 21.7651 4.2120 228.2025 18.7260 1.9720 0.8702 83.9850 1.3083 24.3766 11.9844 7.0859 10.3620 11.1788 75.8442 15.6415 260.2608 57.7717 16.5974 233.5539 358.9615 512.4498 18.6846 26.9196 31.2076 1.5235 14.3188 31.7099 52.0956 33.1526 0.0041 11.6796 37.4967 16.4267 3.6368 104.6307
temp: 298.150 k
press: 1.00000 atm
elementType: 8 8 8 7 7 6 6 6 6 6 6 6 6 6 6 6 6 6 6 1 1 1 1 1 1 1 1 1 1 1 1 1 1
symmnumber: 1
zpe: 674939.8 jmol-1
zpe.correction: 0.257071 hartree
zpe.thermalcorrener: 0.273721 hartree
zpe.thermalcorrenthalpy: 0.274665 hartree
zpe.thermalcorrgfe: 0.210792 hartree
zpe.sumelectzpe: -875.726126 hartree
zpe.sumelectthermal: -875.709477 hartree
zpe.sumelectthermalent: -875.708532 hartree
zpe.sumelectthermalfe: -875.772405 hartree
dipole: -4.8245 -0.1785 -0.0512
dipole: 4.8281
quadrupole: -88.0977 -119.7724 -106.6164
quadrupole: 0.1459 1.2084 6.6626
quadrupole: 16.7311 -14.9436 -1.7876 0.1459 1.2084 6.6626
hfenergy: -875.9831973 hartree
pointgroup: C01 [X(C14H14N2O3)]
dipole: -1.8980305 0.0698353 0.02756 debye
polarizability: 251.0336752|4.2688308|157.7287873|-8.2013211|6.9059203|110.8116495 unknown
InChI: InChI=1S/C14H14N2O3/c1-2-10-8-11-12(19-10)15-14(18)16(13(11)17)9-6-4-3-5-7-9/h3-7,10,15H,2,8H2,1H3
charge 0 multiplicity 1
33 atoms
O  -3.205832 -0.73107 0.609685
O  0.467188 2.122661 -0.324796
O  1.164267 -2.480234 0.66717
N  0.852598 -0.176913 0.172209
N  -0.99548 -1.625423 0.640406
C  -3.825458 0.668755 0.361882
C  -2.624671 1.61316 0.011636
C  -1.42132 0.704523 0.152073
C  -4.883386 0.5270 -0.734383
C  -1.847074 -0.562465 0.470079
C  -0.023642 0.997217 -0.026079
C  -6.043067 -0.417134 -0.357376
C  0.413281 -1.484546 0.499192
C  2.288758 0.019681 0.01247
C  2.954136 0.969659 0.818017
C  2.999374 -0.729305 -0.951131
C  4.342029 1.169869 0.655474
C  4.388449 -0.529854 -1.102588
C  5.063278 0.420463 -0.302164
H  -4.288014 0.918994 1.333128
H  -2.576701 2.477234 0.697367
H  -2.720602 2.01239 -1.015415
H  -4.386953 0.182122 -1.662088
H  -5.273121 1.544131 -0.943592
H  -1.33069 -2.559067 0.884934
H  -5.667047 -1.432184 -0.142527
H  -6.577143 -0.054715 0.540933
H  -6.775569 -0.487874 -1.180628
H  2.389582 1.554952 1.549096
H  2.475137 -1.469364 -1.563023
H  4.857223 1.910489 1.27667
H  4.940914 -1.115747 -1.845121
H  6.14096 0.575894 -0.424012
