program: Gaussian 09
title: 000270287
version: EM64L-G09RevD.01
frameworkgroup: C1[X(C12H10N2O3)]
method: RPBEPBE
basis: SDD
operation: Freq
keyword: #p
keyword: freq=noraman
keyword: PBEPBE/SDD
title: #p freq=noraman PBEPBE/SDD
converged: NO YES NO NO
title: Mulliken charges:
elementType: O O O N N C C C C C C C C C C C C H H H H H H H H H H
charge: -0.254968 -0.220477 -0.230299 -0.380689 -0.381476 0.028894 -0.497215 0.259141 -0.306280 0.115798 0.156103 0.506293 -0.332287 -0.325918 -0.218708 -0.218648 -0.238102 0.254470 0.255961 0.244098 0.244197 0.362254 0.249893 0.245120 0.227252 0.227077 0.228516
chargesum: 0.00000
title: Mulliken charges with hydrogens summed into heavy atoms:
elementType: O O O N N C C C C C C C C C C C C
charge: -0.254968 -0.220477 -0.230299 -0.380689 -0.019222 0.028894 0.013217 0.259141 0.182015 0.115798 0.156103 0.506293 -0.082394 -0.080798 0.008544 0.008429 -0.009585
polarizability: 2.13968360e+02 -2.50381328e+00 1.39277422e+02 2.50063426e+00 1.01281446e+01 9.30357417e+01
1716.lowfreq: -8.8334 -2.6450 0.0001 0.0009 0.0011 7.7571 39.0731 43.2096 54.8738
frequency: 38.9961 43.1679 54.8566 83.0991 111.1337 147.6987 186.7823 246.0471 259.5598 261.1781 286.4189 374.4042 406.6313 418.4732 462.5724 502.2345 544.8691 572.9220 597.6523 613.3884 628.1104 658.9943 694.1685 703.5529 710.3876 725.5748 734.7878 769.1208 818.0253 831.7890 836.8634 873.8865 911.9694 967.0966 968.4050 988.7972 991.0218 992.6033 1028.6100 1045.0173 1050.7951 1087.5042 1116.9114 1156.2503 1172.3932 1177.7721 1187.1650 1201.4528 1244.4097 1278.3790 1291.2249 1317.9026 1329.7490 1362.7352 1386.2702 1439.8589 1472.5274 1482.0457 1486.0608 1511.0653 1598.9516 1610.3373 1617.2551 1657.8749 1675.4997 3008.8573 3050.8032 3058.9138 3125.2146 3130.3256 3142.3688 3156.3153 3167.8090 3176.0260 3565.5536
redmass: 3.3824 3.8846 2.6946 5.6292 5.4415 8.4376 6.8451 7.1697 4.6890 4.8290 6.2257 12.2923 2.8070 6.4380 9.5656 3.8959 6.8207 9.6634 1.2732 5.5053 8.4952 6.3288 1.8460 5.2636 6.3873 5.2758 7.2410 2.1914 1.2108 5.4802 1.3045 5.6834 1.4428 1.4308 3.6966 5.2972 1.3336 6.0733 2.1476 5.1543 1.5814 1.6380 5.4123 1.1189 1.0503 2.7814 1.2857 1.1183 1.9254 1.9617 4.0638 1.3083 1.4183 4.0296 10.0093 2.2558 1.1130 2.1608 1.1996 3.6611 6.5572 6.2106 7.9995 9.2572 9.6335 1.0592 1.0586 1.1055 1.1119 1.0850 1.0893 1.0940 1.0968 1.1002 1.0783
irintensity: 4.5113 0.4275 0.0813 3.0202 0.1000 1.5733 0.5303 5.6833 10.5054 8.4696 8.6504 2.0611 0.4765 2.1645 10.4057 8.3414 34.1494 1.2647 95.0473 6.7380 4.2991 29.6721 51.5462 7.1002 0.0901 13.0215 30.4954 35.9295 0.3916 0.7329 0.0769 71.5130 5.9515 1.2632 9.0427 29.8449 0.3073 2.0599 36.3812 51.5306 0.1112 22.4530 78.3674 0.7649 0.0228 11.2599 1.3181 0.0581 33.1414 9.0421 203.1491 1.7649 9.2970 79.9360 1.3352 12.0028 7.8301 74.6536 0.4534 225.7802 54.6455 20.6091 246.4753 318.8279 500.6703 22.8074 54.0696 7.4804 20.4722 0.0093 10.8924 35.4533 16.8462 4.1693 113.2884
temp: 298.150 k
press: 1.00000 atm
elementType: 8 8 8 7 7 6 6 6 6 6 6 6 6 6 6 6 6 1 1 1 1 1 1 1 1 1 1
symmnumber: 1
zpe: 529858.6 jmol-1
zpe.correction: 0.201812 hartree
zpe.thermalcorrener: 0.215621 hartree
zpe.thermalcorrenthalpy: 0.216565 hartree
zpe.thermalcorrgfe: 0.159845 hartree
zpe.sumelectzpe: -797.270713 hartree
zpe.sumelectthermal: -797.256904 hartree
zpe.sumelectthermalent: -797.255960 hartree
zpe.sumelectthermalfe: -797.312680 hartree
dipole: -4.2168 -0.2745 0.1077
dipole: 4.2271
quadrupole: -72.3154 -106.7971 -94.1196
quadrupole: 1.0251 0.3903 6.5949
quadrupole: 18.7619 -15.7197 -3.0422 1.0251 0.3903 6.5949
hfenergy: -797.4725251 hartree
pointgroup: C01 [X(C12H10N2O3)]
dipole: 1.6586587 0.1146318 0.0386661 debye
polarizability: 213.9305701|-1.6718044|141.0054107|-3.9697545|-4.276742|91.3455427 unknown
InChI: InChI=1S/C12H10N2O3/c15-11-9-6-7-17-10(9)13-12(16)14(11)8-4-2-1-3-5-8/h1-5,13H,6-7H2
charge 0 multiplicity 1
27 atoms
O  3.865576 -0.728467 -0.280449
O  0.129068 2.088318 0.508899
O  -0.487599 -2.459967 -0.752555
N  -0.215214 -0.186153 -0.119222
N  1.663665 -1.612821 -0.526928
C  2.050697 0.687032 0.116927
C  3.241994 1.589863 0.375538
C  2.496313 -0.563874 -0.234873
C  4.448957 0.631539 0.104946
C  0.643837 0.977422 0.199348
C  0.247223 -1.474629 -0.480414
C  -1.658635 0.005421 -0.046129
C  -2.272689 0.985854 -0.855555
C  -2.427481 -0.779702 0.840813
C  -3.668296 1.1809 -0.773653
C  -3.823486 -0.585071 0.911672
C  -4.44726 0.39593 0.107055
H  3.253527 2.462334 -0.301051
H  3.249783 1.974083 1.41065
H  5.075759 0.936476 -0.74718
H  5.074737 0.444726 0.991222
H  2.016261 -2.535026 -0.790283
H  -1.663558 1.597544 -1.526892
H  -1.941076 -1.542616 1.456033
H  -4.14441 1.945138 -1.39727
H  -4.421149 -1.198544 1.594401
H  -5.530638 0.547693 0.16635
