program: Gaussian 09
title: 000270286
version: EM64L-G09RevD.01
frameworkgroup: C1[X(C6H9N3OS)]
method: RPBEPBE
basis: SDD
operation: Freq
keyword: #p
keyword: freq=noraman
keyword: PBEPBE/SDD
title: #p freq=noraman PBEPBE/SDD
converged: YES YES NO NO
title: Mulliken charges:
elementType: S O N N N C C C C C C H H H H H H H H H
charge: -0.019689 -0.265695 -0.413584 -0.064694 -0.615766 -0.423790 0.286577 -0.740753 0.114648 -0.407619 0.187018 0.200668 0.246787 0.318570 0.263696 0.247498 0.326060 0.352548 0.321709 0.085811
chargesum: 0.00000
title: Mulliken charges with hydrogens summed into heavy atoms:
elementType: S O N N N C C C C C C
charge: 0.066121 -0.265695 -0.087524 -0.064694 0.058491 0.023666 0.286577 -0.158487 0.114648 -0.160122 0.187018
polarizability: 1.65747964e+02 4.49681260e+00 1.05027831e+02 1.13492103e+01 -2.01906303e+00 5.56230690e+01
1716.lowfreq: -5.5038 0.0012 0.0020 0.0026 6.3177 11.1535 47.7315 68.8201 85.1670
frequency: 47.7081 68.7844 85.1634 159.5228 174.0594 208.1110 232.6270 269.9054 298.2567 329.3687 374.9082 423.7262 487.7324 526.4186 536.7693 559.2797 663.6555 696.8086 715.0131 735.3624 737.1058 770.3876 799.5154 835.8296 934.4340 952.6058 1007.6850 1023.5553 1044.4574 1104.8098 1158.5673 1236.6109 1256.3381 1276.6713 1293.7572 1315.6215 1324.5618 1370.2263 1445.7342 1457.5117 1469.4345 1557.3577 1573.1811 1622.9010 1641.2915 2425.3152 2994.1063 3035.9789 3054.8121 3117.8844 3131.5602 3492.8642 3556.2547 3707.2671
redmass: 5.7488 5.0437 2.1141 5.4220 5.4544 1.4303 3.2027 2.6554 1.2553 3.8941 6.0578 2.1571 5.3537 1.1713 5.3273 6.3345 3.3442 2.9857 2.2461 3.0045 1.4789 4.6263 3.7447 1.3821 1.4624 3.0982 2.0509 2.0822 2.2954 4.4299 1.1818 3.0662 1.3356 1.2489 2.0193 1.5820 1.4140 1.8715 1.0874 1.1048 5.7399 5.0758 2.4250 2.1074 3.4253 1.0384 1.0596 1.0598 1.1006 1.1074 1.0925 1.0774 1.0455 1.1052
irintensity: 0.8026 0.8593 5.5421 10.0097 0.7078 14.7179 13.0827 5.4691 58.1239 5.5060 2.0462 100.9861 11.3758 176.5508 5.2017 1.7879 25.8852 37.4954 14.4630 1.5532 7.4626 54.9647 29.7144 5.5488 9.0144 8.0799 0.4271 1.0568 3.3061 22.1498 14.4718 10.7773 8.7954 9.3650 1.4973 119.3392 11.3326 0.2616 4.1185 15.5950 27.8092 4.9369 277.4901 770.1915 258.7726 34.4945 20.7719 19.7283 8.2358 6.0466 22.7712 17.3823 133.3459 47.3841
temp: 298.150 k
press: 1.00000 atm
elementType: 16 8 7 7 7 6 6 6 6 6 6 1 1 1 1 1 1 1 1 1
symmnumber: 1
zpe: 396678.0 jmol-1
zpe.correction: 0.151087 hartree
zpe.thermalcorrener: 0.162445 hartree
zpe.thermalcorrenthalpy: 0.163389 hartree
zpe.thermalcorrgfe: 0.113164 hartree
zpe.sumelectzpe: -870.767073 hartree
zpe.sumelectthermal: -870.755715 hartree
zpe.sumelectthermalent: -870.754770 hartree
zpe.sumelectthermalfe: -870.804995 hartree
dipole: -6.2913 -1.3448 -0.8876
dipole: 6.4944
quadrupole: -57.1842 -75.7562 -74.9588
quadrupole: -14.9563 4.5128 -2.3109
quadrupole: 12.1156 -6.4565 -5.6591 -14.9563 4.5128 -2.3109
hfenergy: -870.9181594 hartree
pointgroup: C01 [X(C6H9N3O1S1)]
dipole: 2.4823917 0.5594499 -0.2307214 debye
dipolederiv: -0.4142423 0.0675369 -0.0559845 0.1444126 0.1210177 0.0822831 -0.0367454 0.1042335 -0.2467702 -0.6669973 -0.2346929 -0.0128746 -0.4118994 -1.1068739 -0.0726863 -0.0783309 -0.103818 -0.3800826 -0.8573077 -0.31374 0.0286612 -0.1816615 -0.4704599 -0.0082319 0.0753377 0.0104019 -0.2798278 -1.4577525 -0.163664 0.1320494 0.7730491 -0.5134062 -0.1759675 0.4245163 -0.0237311 -0.3388777 -1.7380248 0.0271 0.1493282 0.1706895 -0.2180258 0.0947219 0.2168961 0.1152593 -0.7409804 -0.1061421 -0.0237982 -0.0408961 -0.1063314 0.1216237 0.0106979 -0.0024946 0.0166018 0.0680009 -0.0511271 0.0432556 -0.0095885 -0.4718098 -0.6681346 -0.0686818 -0.2831595 -0.1517712 -0.1358999 0.5149705 0.0222658 0.0034203 -0.0692697 0.0407894 -0.013384 0.065815 -0.0589839 0.1024643 0.9152395 0.2891341 -0.0599332 0.62522 1.2993571 0.1217927 0.0419163 0.1938166 0.2363278 1.0645997 0.2831849 -0.131933 0.0959257 0.4460392 0.1170227 -0.2034624 0.0731119 -0.0191315 2.0098958 0.0433191 -0.2750619 -0.680377 0.7181258 0.1877178 -0.472618 0.0900243 0.3674474 0.0141856 0.0168251 0.0121769 0.0770078 -0.0910918 -0.1118685 0.0016367 -0.0575247 0.0305144 0.0141792 -0.0188277 0.0454469 -0.0326804 0.0201041 0.0955654 0.0230075 0.052146 -0.0010505 0.0908993 0.0354977 0.0280326 -0.0297975 0.0136349 -0.074087 0.0353545 -0.0344997 0.0741977 -0.0675663 -0.0523886 0.0649697 -0.0265506 -0.0050263 0.116066 0.0093378 0.0663543 -0.0375579 0.0441509 0.0842176 0.0391859 0.1067233 -0.0303854 -0.0549793 0.036506 -0.0529373 0.1061935 0.1321171 -0.0181809 0.0301745 0.0133476 0.1335695 -0.0479258 0.0393436 -0.0427066 0.3133914 0.2894097 0.0301377 0.0302609 0.0701277 0.2007096 -0.0547869 0.0365762 -0.0504574 0.3790012 0.257141 -0.0215314 0.0236769 -0.0712855 0.150451 -0.0471881 0.0114947 -0.0544259 0.3857539 0.0123718 -0.0956508 -0.0011117 0.0051594 -0.1620181 -0.0960803 0.0590723 -0.0910939 0.1168861 unknown
polarizability: 165.9748706|5.841724|102.3688451|-9.6572029|11.2060389|58.0551476 unknown
InChI: InChI=1S/C6H9N3OS/c7-6-8-3-4(1-2-11)5(10)9-6/h3,9,11H,1-2,7H2
charge 0 multiplicity 1
20 atoms
S  -4.596551 0.171321 -0.258846
O  -0.419994 -2.110203 -0.153449
N  1.600675 -0.942673 -0.251537
N  1.810428 1.386849 0.235592
N  3.704718 0.159581 -0.394364
C  -1.883273 0.335312 0.680084
C  -0.397311 0.277937 0.390832
C  -2.730123 0.147714 -0.600442
C  0.18197 -1.00148 -0.009623
C  0.447283 1.382614 0.489554
C  2.353634 0.215537 -0.130915
H  -2.130657 1.304318 1.154705
H  -2.160884 -0.464897 1.391348
H  -2.545499 -0.846813 -1.036397
H  -2.503484 0.920111 -1.353708
H  0.042078 2.354769 0.794376
H  2.019627 -1.837985 -0.525815
H  4.226237 1.027404 -0.29258
H  4.184265 -0.689436 -0.679411
H  -4.654838 1.494517 0.153996
