program: Gaussian 09
title: 000275979
version: EM64L-G09RevD.01
frameworkgroup: C1[X(C24H25NO2S)]
method: RPBEPBE
basis: SDD
operation: Freq
keyword: #p
keyword: freq=noraman
keyword: PBEPBE/SDD
title: #p freq=noraman PBEPBE/SDD
converged: YES YES NO NO
title: Mulliken charges:
elementType: S O O N C C C C C C C C C C C C C C C C C C C C C C C C H H H H H H H H H H H H H H H H H H H H H H H H H
charge: 0.162925 -0.401457 -0.242823 -0.579686 -0.582545 0.470991 0.511053 0.363234 -0.650431 -0.404234 -0.407336 -0.340764 -0.374208 -0.382235 -0.334393 -0.183107 -0.441164 -0.440633 -0.374412 -0.380030 0.439823 0.443951 -0.257447 -0.242180 -0.247471 -0.810507 -0.810563 0.225689 0.252856 0.288703 0.259906 0.249286 0.250894 0.255916 0.260336 0.273635 0.259526 0.229256 0.227227 0.226867 0.229585 0.224326 0.231998 0.227835 0.227209 0.223598 0.233176 0.228654 0.231539 0.224014 0.283546 0.294239 0.375839
chargesum: 0.00000
title: Mulliken charges with hydrogens summed into heavy atoms:
elementType: S O O N C C C C C C C C C C C C C C C C C C C C C C C C
charge: 0.162925 -0.025619 -0.242823 -0.001901 -0.582545 0.470991 0.511053 0.363234 -0.108873 -0.144329 -0.158050 -0.089870 -0.118292 -0.121899 -0.060758 0.076419 -0.211908 -0.213406 -0.147544 -0.150445 0.439823 0.443951 -0.033121 -0.010182 -0.019637 -0.126524 -0.126357 0.225689
polarizability: 3.02110821e+02 -5.68489922e+00 3.12398545e+02 1.66545867e+01 5.42770134e+00 2.67069989e+02
1716.lowfreq: -10.5316 -6.9318 -3.8047 -0.0009 -0.0005 0.0010 2.6083 16.8360 19.6224
frequency: -6.8683 16.5807 19.6093 20.9931 31.8815 40.4507 42.5799 46.9986 49.8754 52.9367 69.9107 85.4483 90.4106 128.7797 155.9011 161.9096 180.0744 195.1534 219.9939 237.5529 248.9567 251.4804 260.0811 285.3809 296.1731 311.4536 318.0109 346.5676 355.0519 371.5331 388.0123 400.9885 407.6604 411.2718 457.9159 486.3455 498.6594 520.7788 533.1656 558.1380 578.8369 592.5228 615.1284 620.7704 629.8521 637.6208 647.6320 689.7548 702.7299 717.1957 724.4489 729.6009 741.2284 756.7568 779.3982 787.4215 804.8283 821.8535 837.0249 850.6758 852.1430 861.0073 889.3833 899.5423 920.5803 937.1812 958.9471 963.6281 977.2941 979.4063 986.5326 986.8648 988.0740 990.3744 999.9295 1012.2341 1014.2862 1016.5871 1029.9090 1047.1410 1047.2880 1061.9928 1086.5799 1087.3035 1114.3933 1127.1086 1129.6431 1143.1260 1173.0105 1178.0706 1188.0555 1194.3072 1198.1783 1201.1455 1212.8808 1224.2516 1225.5068 1249.1436 1264.5411 1305.0426 1309.5839 1320.6706 1327.9614 1359.9086 1362.3151 1377.1369 1397.7954 1398.7439 1398.9846 1401.8164 1405.6244 1432.3533 1439.6884 1470.0614 1470.1570 1473.9224 1474.3049 1478.7762 1498.6771 1501.0994 1576.9172 1577.8535 1585.6135 1607.1877 1612.2948 1620.5033 1622.2115 1670.3314 2974.7134 2975.8767 3015.5653 3053.3111 3053.4532 3063.5979 3082.4935 3083.4494 3099.8484 3114.7411 3115.8372 3120.6005 3120.8745 3124.4515 3135.5053 3141.7669 3142.5141 3147.7721 3156.0674 3157.2474 3158.9594 3168.0830 3477.8991 3501.1887 3618.3796
redmass: 4.1947 1.3526 1.0534 2.8982 4.4414 3.8273 4.2956 4.7829 6.1414 4.3719 4.1112 5.5672 4.3334 4.4868 4.3194 4.0307 4.4383 5.4388 1.7830 4.1713 5.0733 3.9965 4.2610 4.2658 1.7139 4.5502 4.8622 3.4116 3.6473 3.2841 5.5742 2.8543 2.8916 2.9166 3.4079 3.9396 3.0460 3.2032 1.5493 4.3798 3.8734 2.9131 6.1574 1.3651 6.2814 6.9229 6.2024 4.6553 2.4428 2.7354 4.3472 2.8449 2.3414 2.9760 3.7207 3.3409 2.4650 1.7799 2.0320 1.2518 1.2505 1.2586 4.9733 3.6524 1.5556 1.4880 1.4084 1.3576 1.3753 1.3751 1.4397 1.4386 1.4243 4.5806 1.3241 3.5811 3.1301 3.7036 2.2314 1.5550 1.5548 2.5030 1.6247 1.5577 1.5580 1.3260 1.3479 3.5664 1.0562 1.4130 2.4236 1.1533 1.2232 1.3022 3.7864 2.6303 2.7888 1.3094 1.5130 1.2994 1.3115 1.3436 1.2200 4.8083 4.7237 7.4774 1.2373 1.2489 1.7866 3.2955 3.2797 2.0335 1.1639 1.0548 1.0460 1.0938 1.1068 2.1496 2.5243 2.5398 5.9043 5.9353 6.0997 5.8555 1.2595 6.3314 6.3633 4.2304 1.0375 1.0372 1.0565 1.0969 1.0975 1.0877 1.0990 1.0987 1.1062 1.0877 1.0876 1.0889 1.0890 1.0850 1.0881 1.0957 1.0953 1.0932 1.0944 1.0933 1.0948 1.1002 1.0444 1.0637 1.0996
irintensity: 0.2786 0.2537 0.4987 0.3771 0.3114 0.0675 0.3858 2.6992 2.6382 0.6666 0.3828 1.3223 0.1946 1.0456 0.8220 0.5429 0.9307 1.5860 38.6416 2.1358 1.4086 2.5958 0.5656 4.6234 45.3361 1.4016 1.3367 0.6365 2.2514 2.0611 5.9318 0.0458 0.1693 0.2013 25.2391 0.3339 8.6594 4.8534 300.2643 14.7452 19.1460 11.9779 1.5685 256.8405 12.2338 0.4042 5.5816 2.5135 10.2937 61.8643 75.4806 12.4535 38.4636 9.2428 10.1393 4.1873 26.2345 35.7677 12.4909 0.6320 0.4390 1.6584 2.4778 0.9395 5.7806 0.2328 0.0233 0.3287 0.6034 0.3380 0.5351 2.7445 4.3299 1.2917 0.3536 45.5145 6.2647 79.9096 9.7877 14.2947 9.4986 165.9622 2.2765 25.8748 5.8637 4.6818 9.1537 1.1203 0.4896 5.7120 9.9870 12.4364 2.0369 5.4284 7.8372 0.0629 0.0979 4.0713 7.9938 1.3775 2.6802 0.9356 4.1823 5.7644 1.8322 0.7856 9.3426 9.3408 14.9175 3.4418 2.7793 15.8571 6.4479 13.2383 12.3619 14.8784 15.2111 20.4359 44.1627 35.7806 0.8617 3.6472 1.4078 1.3685 108.0946 3.4906 1.3542 107.8464 47.5583 43.3609 24.3580 20.4733 20.3633 8.6909 18.4004 18.9937 6.3490 14.4193 16.3552 32.0963 17.0014 1.6731 5.3878 8.6072 20.9790 26.4907 3.6984 6.4062 19.2734 17.6772 13.0245 20.7551 8.2425
temp: 298.150 k
press: 1.00000 atm
elementType: 16 8 8 7 6 6 6 6 6 6 6 6 6 6 6 6 6 6 6 6 6 6 6 6 6 6 6 6 1 1 1 1 1 1 1 1 1 1 1 1 1 1 1 1 1 1 1 1 1 1 1 1 1
symmnumber: 1
zpe: 1115632.9 jmol-1
zpe.correction: 0.424922 hartree
zpe.thermalcorrener: 0.452351 hartree
zpe.thermalcorrenthalpy: 0.453295 hartree
zpe.thermalcorrgfe: 0.362968 hartree
zpe.sumelectzpe: -1530.805282 hartree
zpe.sumelectthermal: -1530.777853 hartree
zpe.sumelectthermalent: -1530.776909 hartree
zpe.sumelectthermalfe: -1530.867236 hartree
dipole: -1.7907 -1.4540 0.4386
dipole: 2.3480
quadrupole: -171.0805 -148.6405 -166.8484
quadrupole: -2.6779 1.5292 0.9231
quadrupole: -8.8907 13.5493 -4.6586 -2.6779 1.5292 0.9231
hfenergy: -1531.2302037 hartree
pointgroup: C01 [X(C24H25N1O2S1)]
dipole: 0.370068 0.794624 0.2914951 debye
polarizability: 304.8768222|-5.3306573|308.5315422|-19.0808496|-3.6211706|268.1709901 unknown
InChI: InChI=1S/C24H25NO2S/c1-17-8-12-20(13-9-17)24(19-6-4-3-5-7-19,28-16-22(25)23(26)27)21-14-10-18(2)11-15-21/h3-15,22,26H,16,25H2,1-2H3
charge 0 multiplicity 1
53 atoms
S  -1.0688 -0.354711 -1.417184
O  -3.38882 -2.846402 -2.514512
O  -3.616994 -2.984935 -0.206794
N  -5.2004 -0.568286 -0.709476
C  0.250162 0.155534 -0.032118
C  1.549204 -0.518952 -0.532723
C  0.475926 1.68505 -0.00524
C  -0.267185 -0.404566 1.303526
C  -2.742565 -0.020927 -0.580007
C  2.357801 -1.338317 0.290684
C  -0.343157 2.619394 -0.677101
C  2.010614 -0.236246 -1.84742
C  1.577161 2.188947 0.742126
C  -0.547955 0.427936 2.416245
C  -0.528269 -1.798126 1.425621
C  -3.877295 -0.791808 -1.314734
C  3.575595 -1.872706 -0.191676
C  -0.080858 4.008009 -0.601004
C  3.217464 -0.778371 -2.326419
C  1.834433 3.570908 0.819035
C  4.025718 -1.612146 -1.50764
C  1.00731 4.512262 0.149285
C  -1.05669 -0.116082 3.619906
C  -1.038882 -2.341038 2.620824
C  -1.301567 -1.501635 3.730644
C  5.321787 -2.20309 -2.034787
C  1.296644 6.001283 0.227764
C  -3.612209 -2.299183 -1.252924
H  -2.964452 1.060215 -0.599932
H  -2.677895 -0.368216 0.464744
H  2.046685 -1.559904 1.316118
H  -1.169359 2.257773 -1.296856
H  1.417848 0.420687 -2.494306
H  2.243515 1.487319 1.256577
H  -0.370279 1.505088 2.348296
H  -0.36157 -2.448027 0.56025
H  -3.914938 -0.492593 -2.375226
H  4.183941 -2.501111 0.47048
H  -0.730923 4.706933 -1.141825
H  3.544167 -0.547598 -3.348188
H  2.694451 3.926598 1.400496
H  -1.265443 0.548678 4.465997
H  -1.24915 -3.414359 2.679367
H  -1.702956 -1.921549 4.659819
H  5.953253 -1.430894 -2.511825
H  5.910528 -2.672473 -1.22778
H  5.12499 -2.978948 -2.799586
H  1.290927 6.358227 1.274926
H  2.293112 6.239602 -0.189951
H  0.548665 6.588332 -0.332459
H  -5.598849 0.360567 -0.859809
H  -5.286553 -0.914361 0.250653
H  -3.21079 -3.822981 -2.426182
