program: Gaussian 09
title: 000025894
version: EM64L-G09RevD.01
frameworkgroup: C1[X(C20H14O)]
method: RPBEPBE
basis: SDD
operation: Freq
keyword: #pfreq=noraman
keyword: PBEPBE/SDD
title: #p freq=noraman PBEPBE/SDD
converged: YES YES NO NO
title: Mulliken charges:
elementType: O C C C C C C C C C C C C C C C C C C C C H H H H H H H H H H H H H H
charge: -0.234482 0.109261 0.299799 0.006156 0.276943 0.138589 0.247717 -0.010304 0.408862 -0.430375 -0.503037 -0.873095 -0.407542 -0.357112 -0.399627 -0.443755 -0.265897 -0.208584 -0.252231 -0.261662 -0.249348 0.232514 0.238854 0.230878 0.279746 0.245973 0.252416 0.263498 0.316400 0.244031 0.230223 0.176216 0.233710 0.231395 0.233870
chargesum: 0.00000
title: Mulliken charges with hydrogens summed into heavy atoms:
elementType: O C C C C C C C C C C C C C C C C C C C C
charge: -0.234482 0.109261 0.299799 0.006156 0.276943 0.138589 0.247717 -0.010304 0.408862 -0.197862 -0.264183 -0.116498 -0.155126 -0.093614 -0.083227 -0.199724 -0.035674 -0.032369 -0.018521 -0.030267 -0.015478
polarizability: 4.11453261e+02 3.93237563e+00 2.57231751e+02 2.94140295e+00 5.60362169e+00 9.31511494e+01
1716.lowfreq: -8.3485 -1.0183 -0.0002 0.0003 0.0006 9.6494 44.7648 56.4081 97.5934
frequency: 44.7595 56.3891 97.5909 110.3261 135.1546 167.4085 192.8163 212.3044 258.8264 266.3842 278.4872 314.9138 348.7884 357.8913 364.9142 392.0065 412.8564 444.0393 445.5737 502.4483 515.5839 520.1971 540.2125 570.5357 586.7202 603.6781 617.2944 627.0186 671.5335 695.6396 728.3870 761.7598 768.5360 783.0555 793.9770 804.7704 812.1153 831.4865 880.4812 885.6528 890.8915 952.7822 958.4734 968.6552 976.2448 978.0609 991.3191 1004.0137 1013.3830 1033.5687 1036.5368 1046.0069 1074.9113 1079.7129 1114.0979 1150.8019 1178.5850 1182.9636 1185.9222 1236.8698 1246.6096 1263.8585 1283.6040 1310.0223 1329.2000 1364.3332 1372.2062 1394.2574 1396.6258 1408.0605 1425.1257 1426.7024 1438.1426 1450.2010 1470.6860 1485.3383 1496.1831 1506.2471 1538.1551 1548.2025 1561.9767 1578.0406 1608.7211 1613.6178 1626.9113 2933.1548 2976.6684 3059.4344 3110.2850 3125.1617 3130.7524 3131.0433 3137.6473 3149.4785 3160.5580 3169.7870 3174.8138 3183.6636 3186.1115
redmass: 5.4985 4.8824 3.9707 3.7824 3.1359 3.7517 3.9778 4.1400 6.0581 4.9946 1.4237 4.0149 5.6849 4.7113 3.6883 2.7896 3.3869 4.3946 3.4764 4.9143 3.8946 4.0379 4.5164 5.1578 3.4276 4.2869 4.4289 6.2906 5.7794 3.3313 4.4766 1.2910 1.4144 3.1693 4.7869 2.9980 5.4540 1.8207 3.8994 1.5218 1.5747 1.9428 1.3745 3.9790 1.3857 1.4607 1.3678 3.0267 1.3377 1.6031 2.6365 2.1477 2.1357 3.7554 2.2711 1.6541 1.0923 1.2565 1.1756 1.9258 1.6367 1.9857 2.1095 2.1589 4.3780 4.6241 3.9094 4.5435 1.2109 2.0225 4.5889 2.4149 1.7822 2.2569 1.2756 1.4847 2.8264 1.4941 5.6199 5.5178 6.3914 5.7868 6.1313 5.8984 6.5774 1.0830 1.0434 1.0923 1.0970 1.0870 1.0888 1.0865 1.0902 1.0917 1.0978 1.0960 1.0939 1.0959 1.0941
irintensity: 1.4328 0.4689 0.1253 6.2934 1.5750 4.5348 2.8328 4.3977 3.6047 2.7625 0.2641 2.1875 1.0459 1.2578 0.6260 2.9597 2.5725 1.6283 1.0496 2.6041 2.2993 6.1935 12.0252 10.5773 3.3384 2.5246 1.7253 2.4981 2.6122 10.5786 17.5624 43.9847 63.9720 32.6870 12.7404 16.6079 0.4862 44.9863 3.4599 5.5017 2.9935 1.0601 1.5106 9.8414 3.7731 0.6917 0.5080 2.7160 3.0237 6.9173 9.4081 8.7994 1.2256 19.6442 5.4690 15.8331 0.8602 11.4197 13.4046 7.2574 5.7826 14.6411 72.5228 12.2038 6.7784 14.2309 22.4163 2.9653 10.2918 5.8044 26.2111 20.7198 6.5338 2.9321 23.8912 8.5810 13.6713 23.6851 88.2051 2.8166 98.4719 176.2226 16.2192 6.4050 1.0846 83.0425 19.1620 16.8460 8.3482 1.7430 9.0441 4.3774 13.8001 21.4217 39.0401 22.5977 15.9353 21.8359 13.1690
temp: 298.150 k
press: 1.00000 atm
elementType: 8 6 6 6 6 6 6 6 6 6 6 6 6 6 6 6 6 6 6 6 6 1 1 1 1 1 1 1 1 1 1 1 1 1 1
symmnumber: 1
zpe: 719122.6 jmol-1
zpe.correction: 0.273899 hartree
zpe.thermalcorrener: 0.289715 hartree
zpe.thermalcorrenthalpy: 0.290659 hartree
zpe.thermalcorrgfe: 0.231229 hartree
zpe.sumelectzpe: -844.359414 hartree
zpe.sumelectthermal: -844.343599 hartree
zpe.sumelectthermalent: -844.342655 hartree
zpe.sumelectthermalfe: -844.402084 hartree
dipole: 3.6963 -3.3441 0.2204
dipole: 4.9894
quadrupole: -113.5324 -112.9901 -127.0556
quadrupole: 14.6049 -0.3293 2.4496
quadrupole: 4.3270 4.8693 -9.1963 14.6049 -0.3293 2.4496
hfenergy: -844.6333134 hartree
pointgroup: C01 [X(C20H14O1)]
dipole: 1.4134596 1.3621147 0.0090519 debye
polarizability: 411.5217894|1.072918|255.4160864|-4.2498832|17.5849112|94.8982859 unknown
InChI: InChI=1S/C20H14O/c1-13-15-7-4-5-9-17(15)19(12-21)18-11-10-14-6-2-3-8-16(14)20(13)18/h2-12H,1H3
charge 0 multiplicity 1
35 atoms
O  -3.097735 -3.130644 -0.024681
C  0.559578 0.24311 -0.094617
C  0.006108 -1.104255 -0.204906
C  -0.333165 1.352151 -0.176669
C  -1.755237 1.137419 -0.064029
C  2.024888 0.388167 0.048858
C  -2.302424 -0.205492 0.037096
C  -1.407783 -1.333109 -0.09137
C  2.882163 -0.721044 -0.281607
C  0.923494 -2.183172 -0.542833
C  2.283498 -1.9865 -0.638453
C  0.145278 2.760757 -0.504158
C  -2.659326 2.255453 -0.000904
C  2.651782 1.550186 0.595526
C  -3.721866 -0.356525 0.217329
C  4.299327 -0.594201 -0.190481
C  -4.030365 2.075039 0.174108
C  -1.892775 -2.732637 -0.029199
C  -4.563068 0.754959 0.285649
C  4.049488 1.652234 0.708007
C  4.887067 0.58764 0.282044
H  0.527106 -3.171219 -0.785301
H  2.940084 -2.811415 -0.938982
H  0.15678 3.431325 0.377538
H  1.155765 2.755395 -0.937151
H  -0.529999 3.218151 -1.247768
H  -2.263885 3.272877 -0.056502
H  2.040293 2.362509 0.992282
H  -4.129642 -1.366559 0.280653
H  4.924269 -1.450855 -0.469415
H  -4.696116 2.942849 0.235841
H  -1.095771 -3.502568 0.065176
H  -5.640487 0.612084 0.424029
H  4.4916 2.555132 1.143132
H  5.975975 0.677459 0.355756
