program: Gaussian 09
title: 000270272
version: EM64L-G09RevD.01
frameworkgroup: C1[X(C13H14N2O2)]
method: RPBEPBE
basis: SDD
operation: Freq
keyword: #p
keyword: freq=noraman
keyword: PBEPBE/SDD
title: #p freq=noraman PBEPBE/SDD
converged: YES YES NO NO
title: Mulliken charges:
elementType: O O N N C C C C C C C C C C C C C H H H H H H H H H H H H H H
charge: -0.480538 -0.259059 -0.401375 0.002798 -0.690534 0.122544 0.292120 0.354351 -0.040560 0.125794 -0.837822 0.130895 -0.355921 -0.396686 -0.256801 -0.775742 -0.215324 0.239371 0.258428 0.314815 0.219806 0.247678 0.331420 0.298553 0.212176 0.228576 0.286253 0.229652 0.232823 0.225644 0.356664
chargesum: 0.00000
title: Mulliken charges with hydrogens summed into heavy atoms:
elementType: O O N N C C C C C C C C C C C C C
charge: -0.123874 -0.259059 -0.086560 0.002798 -0.192735 0.122544 0.292120 0.354351 -0.040560 0.125794 -0.038918 0.130895 -0.057369 -0.184510 -0.028225 -0.027014 0.010320
polarizability: 1.92399247e+02 6.44987007e+00 1.74235030e+02 3.34834586e+00 -3.76436680e+00 1.07661807e+02
1716.lowfreq: -13.5511 -4.2601 -0.0007 -0.0003 0.0006 7.5042 16.8537 40.5047 63.5333
frequency: 16.5672 40.4778 63.5305 81.0788 94.4585 105.1242 166.1267 177.2413 186.0101 192.8323 260.7216 280.6545 312.9323 345.9795 357.1597 364.5582 426.3642 437.1478 489.8679 512.2330 518.8500 545.7039 557.7128 569.2535 591.6014 598.7466 621.0786 631.4885 702.9410 749.2141 754.9710 757.3931 808.9731 833.8288 851.0210 864.6937 940.6278 947.1894 964.4316 993.7445 1033.2566 1038.0158 1046.7839 1051.5733 1057.3731 1080.0448 1096.0280 1154.2424 1169.9413 1185.4537 1210.5276 1219.1944 1233.1764 1287.6313 1303.0116 1320.2168 1331.6639 1390.9849 1391.4197 1411.6387 1426.4907 1436.0246 1454.1121 1462.5131 1471.6091 1476.7653 1491.1075 1500.2723 1555.7764 1594.8829 1598.4493 1615.9722 1642.4935 2968.6599 2984.5821 3014.7343 3045.0391 3063.7033 3085.1148 3103.4042 3105.2644 3133.9413 3138.6711 3145.8188 3164.5343 3530.6016 3585.9997
redmass: 3.7989 4.5379 1.0649 2.5442 5.3447 1.4936 5.1745 3.3040 4.8576 5.0019 4.0936 2.5607 4.5740 1.6384 2.0887 2.3115 3.0841 4.0363 4.2399 5.3547 5.7941 4.2179 4.9987 4.2452 5.4933 5.0730 4.3739 1.1761 3.8293 5.3513 3.2117 1.6631 5.4449 4.0275 1.5575 2.3381 2.3221 1.3620 2.5235 1.3191 1.5448 2.1728 1.5487 1.5299 2.8258 4.3840 2.3926 1.3042 1.1206 1.9722 3.2131 1.6752 2.6277 2.4489 1.4333 1.5044 2.2314 6.4677 1.2873 1.2196 2.0977 2.3038 1.1135 1.1874 1.0463 1.2861 2.2968 1.0948 6.7655 4.4790 6.3411 6.5107 6.7256 1.0388 1.0394 1.0617 1.0974 1.0980 1.0996 1.0982 1.0887 1.0879 1.0967 1.0940 1.1004 1.0780 1.0659
irintensity: 2.7417 2.6663 0.1342 0.7878 8.7863 0.7206 1.5900 0.2818 0.0747 2.2167 7.8273 1.3832 1.8818 79.9689 37.8585 18.5165 3.1971 1.5837 8.7437 8.5930 10.3514 2.5263 1.2613 1.0547 0.0972 4.2230 1.4066 84.0908 9.2828 7.3199 46.7692 51.4602 9.4284 15.8385 0.2155 3.1956 2.6398 4.3356 17.2738 2.3739 1.7090 18.9438 3.0010 3.8667 32.8937 59.1896 55.4195 40.2049 4.2440 4.7610 13.0174 7.3266 37.9305 27.0320 8.5874 28.7783 9.1920 3.1349 47.3536 26.5103 107.6158 48.7118 17.8411 51.3970 18.0562 12.8145 53.0591 17.5021 308.6918 63.2548 27.3425 1.8211 136.7667 41.5117 19.3094 12.3224 16.1261 16.9304 3.1820 10.0180 15.6791 11.7131 2.5963 3.0720 31.6058 32.2218 25.5657
temp: 298.150 k
press: 1.00000 atm
elementType: 8 8 7 7 6 6 6 6 6 6 6 6 6 6 6 6 6 1 1 1 1 1 1 1 1 1 1 1 1 1 1
symmnumber: 1
zpe: 643131.8 jmol-1
zpe.correction: 0.244956 hartree
zpe.thermalcorrener: 0.261012 hartree
zpe.thermalcorrenthalpy: 0.261956 hartree
zpe.thermalcorrgfe: 0.200200 hartree
zpe.sumelectzpe: -762.517677 hartree
zpe.sumelectthermal: -762.501621 hartree
zpe.sumelectthermalent: -762.500677 hartree
zpe.sumelectthermalfe: -762.562433 hartree
dipole: 0.3399 7.8869 -3.3327
dipole: 8.5688
quadrupole: -78.0545 -99.0436 -100.4904
quadrupole: 9.1468 -3.6227 2.6748
quadrupole: 14.4750 -6.5141 -7.9609 9.1468 -3.6227 2.6748
hfenergy: -762.7626331 hartree
pointgroup: C01 [X(C13H14N2O2)]
dipole: -0.2926259 -2.6974234 2.0008878 debye
polarizability: 192.365746|-2.873196|128.3710106|-8.6782073|-30.5699967|153.5593274 unknown
InChI: InChI=1S/C13H14N2O2/c1-8-11(13(17)15-9(2)14-8)7-10-5-3-4-6-12(10)16/h3-6,14,16H,7H2,1-2H3
charge 0 multiplicity 1
31 atoms
O  2.223769 -0.90372 1.955353
O  -1.007456 2.085487 -1.504097
N  -2.847125 -0.925655 0.491962
N  -2.891788 0.71908 -1.230105
C  0.464257 0.985727 0.693539
C  -0.915111 0.475445 0.293939
C  -1.567224 -0.558887 0.944834
C  1.612747 0.306103 -0.056691
C  -1.575365 1.149775 -0.857308
C  -3.466345 -0.273583 -0.573715
C  -1.053969 -1.34003 2.131736
C  2.476302 -0.618288 0.586688
C  1.863979 0.596798 -1.421914
C  3.547854 -1.236123 -0.099252
C  2.927809 -0.014507 -2.122946
C  -4.84578 -0.759036 -0.956494
C  3.773038 -0.932812 -1.45968
H  0.619862 0.87935 1.779128
H  0.481359 2.062307 0.4443
H  -3.333347 -1.693148 0.960396
H  -1.298531 -2.415353 2.033337
H  -1.515433 -0.975974 3.070654
H  0.038139 -1.249911 2.228256
H  1.204024 1.31581 -1.920137
H  4.202605 -1.946801 0.42355
H  3.098164 0.229597 -3.176722
H  -5.212933 -0.136445 -1.784001
H  -5.5545 -0.680673 -0.110599
H  -4.826083 -1.813803 -1.290037
H  4.603518 -1.409839 -1.991647
H  2.941662 -1.475592 2.323175
