program: Gaussian 09
title: 000270271
version: EM64L-G09RevD.01
frameworkgroup: C1[X(C22H18N2O2)]
method: RPBEPBE
basis: SDD
operation: Freq
keyword: #p
keyword: freq=noraman
keyword: PBEPBE/SDD
title: #p freq=noraman PBEPBE/SDD
converged: YES YES NO NO
title: Mulliken charges:
elementType: O O N N C C C C C C C C C C C C C C C C C C C C C C H H H H H H H H H H H H H H H H H H
charge: -0.436327 -0.240592 -0.438859 0.008689 -0.663480 0.276972 0.135817 0.207097 0.244266 0.440434 0.132122 0.300431 -0.071099 -0.396151 -0.465372 -0.424283 0.118028 -0.441981 -0.278282 -0.255568 -0.365911 -0.425496 -0.778873 -0.212116 -0.229088 -0.239064 0.221572 0.288109 0.327699 0.225863 0.237351 0.215447 0.238221 0.225839 0.227833 0.247850 0.247083 0.231380 0.230362 0.284705 0.356636 0.231199 0.228926 0.232610
chargesum: 0.00000
title: Mulliken charges with hydrogens summed into heavy atoms:
elementType: O O N N C C C C C C C C C C C C C C C C C C C C C C
charge: -0.079691 -0.240592 -0.111160 0.008689 -0.153799 0.276972 0.135817 0.207097 0.244266 0.440434 0.132122 0.300431 -0.071099 -0.170287 -0.228021 -0.208836 0.118028 -0.203760 -0.052444 -0.027735 -0.118061 -0.178413 -0.032426 0.019083 -0.000162 -0.006454
polarizability: 3.24210544e+02 3.95286445e+01 2.14623277e+02 -2.53588576e+01 1.09706232e+01 2.28675125e+02
1716.lowfreq: -10.8072 -5.1289 -0.0011 -0.0008 -0.0006 5.9878 14.5898 22.5571 33.2246
frequency: 13.9782 22.4096 33.0654 41.4873 45.7802 62.9941 77.2353 97.8014 112.2790 137.2005 155.7402 186.7178 216.3564 235.1833 261.6697 269.1782 295.4499 310.8649 323.4125 329.9465 342.4573 355.8952 403.7022 414.0639 427.7257 456.8165 486.8379 496.1188 516.8635 530.6109 545.3052 550.6533 587.7771 591.3307 612.9810 631.9140 638.4335 649.5258 657.5646 661.2949 695.7597 701.5012 728.8027 750.6016 753.9912 765.5481 777.0065 802.0043 807.7207 836.7284 850.3931 854.5489 869.7993 882.3840 920.3700 932.9057 954.9935 960.3780 975.7461 981.3825 985.3962 989.5759 997.1425 1014.4118 1032.6475 1033.3203 1045.2306 1045.9002 1075.4922 1082.7208 1145.1489 1152.4573 1161.2157 1174.3208 1175.1183 1183.0384 1189.2680 1206.9996 1228.7173 1240.6143 1250.6531 1270.4551 1286.8600 1306.3283 1315.8480 1339.7704 1368.7599 1377.7244 1390.4149 1403.7991 1420.0652 1426.4822 1435.7174 1436.0587 1463.8772 1469.4758 1470.4711 1472.7452 1482.8637 1517.4381 1559.1085 1583.2092 1588.5709 1592.1034 1608.3117 1611.5902 1627.3700 1634.1239 2979.7931 2984.2234 3045.7157 3062.9520 3108.2693 3118.8273 3120.2329 3127.6202 3133.5279 3137.7855 3143.3101 3144.2125 3146.5065 3155.5533 3161.6313 3169.9150 3525.4070 3580.7149
redmass: 5.1199 4.9232 1.2650 3.2186 3.7439 6.4991 4.8204 4.4798 6.0323 4.1958 6.5858 4.8873 4.2783 4.5088 3.4105 3.5796 4.1285 5.3579 1.3563 2.2559 5.9938 4.2193 2.8212 3.2767 7.0817 4.3962 4.0874 4.3414 4.2642 3.6361 8.0645 4.2038 4.4813 4.4296 6.1231 4.9881 2.2527 4.9626 1.9655 3.7251 5.1733 1.8343 5.3546 1.5824 3.1400 2.5439 2.6175 1.7473 2.8826 5.6444 1.2700 3.6559 1.7054 3.8617 1.4215 1.3358 2.9284 1.4299 1.4130 1.9406 1.4200 4.6315 1.3555 5.2156 2.2439 2.2441 2.9883 1.6402 3.2240 1.6369 1.4254 2.1718 1.2963 1.1119 1.0611 4.3664 1.1176 1.7187 1.6539 1.6241 3.7838 1.7118 1.8714 1.9758 1.4765 2.2408 2.7025 6.9449 1.2873 2.9932 3.8525 2.1679 2.2178 2.9162 1.2653 1.9714 1.1036 1.4229 2.3975 3.7354 8.3709 5.9474 7.7939 4.6014 5.7441 6.4374 7.4343 6.6550 1.0663 1.0394 1.0901 1.0980 1.0876 1.0858 1.0871 1.0880 1.0868 1.0967 1.0962 1.0921 1.0936 1.0960 1.1001 1.1014 1.0780 1.0661
irintensity: 0.0449 0.4200 1.9045 0.4785 0.8330 2.7756 0.8928 0.6412 0.7353 1.0031 2.3988 2.2340 8.9292 2.5655 3.8386 1.6194 8.0640 1.2956 64.7729 30.6758 1.5664 7.9734 0.4247 3.4436 1.2513 4.6451 6.7606 22.5266 2.5460 2.1631 0.5957 4.8104 2.9041 1.5147 0.2109 6.0000 27.6853 4.5944 47.9515 10.0802 2.2608 46.4765 5.6098 26.7867 1.6469 57.1323 3.9401 24.9777 67.1500 7.2893 3.3689 1.8034 5.4372 4.7507 5.1104 1.3249 18.2578 4.5277 0.6899 37.5502 2.4395 3.9078 1.4424 28.3297 14.7007 18.6196 29.4771 3.2507 4.6024 6.8620 50.6114 7.3374 17.4079 0.7509 0.2827 23.9792 0.6023 13.5125 4.5668 22.4990 97.7761 14.9273 34.0440 2.1871 3.1491 12.0325 8.5772 0.2012 45.2787 10.1334 36.6353 111.4399 32.3101 22.3436 22.8601 6.1509 15.6693 54.7635 8.3020 31.1106 381.3202 5.8633 1.8974 90.0277 12.2417 35.6222 75.4675 28.5663 24.2922 17.8522 13.5846 15.8275 10.8279 3.4524 4.7142 5.2856 0.6719 2.8701 12.5026 16.0073 38.1719 28.4644 29.5056 14.2787 33.1591 45.7741
temp: 298.150 k
press: 1.00000 atm
elementType: 8 8 7 7 6 6 6 6 6 6 6 6 6 6 6 6 6 6 6 6 6 6 6 6 6 6 1 1 1 1 1 1 1 1 1 1 1 1 1 1 1 1 1 1
symmnumber: 1
zpe: 899019.5 jmol-1
zpe.correction: 0.342418 hartree
zpe.thermalcorrener: 0.364530 hartree
zpe.thermalcorrenthalpy: 0.365474 hartree
zpe.thermalcorrgfe: 0.288816 hartree
zpe.sumelectzpe: -1107.314590 hartree
zpe.sumelectthermal: -1107.292478 hartree
zpe.sumelectthermalent: -1107.291534 hartree
zpe.sumelectthermalfe: -1107.368192 hartree
dipole: 2.7318 7.3451 4.0749
dipole: 8.8327
quadrupole: -147.1940 -158.7819 -132.7595
quadrupole: -19.8499 -11.5975 -9.2739
quadrupole: -0.9489 -12.5367 13.4856 -19.8499 -11.5975 -9.2739
hfenergy: -1107.6570081 hartree
pointgroup: C01 [X(C22H18N2O2)]
dipole: 1.0167793 -2.242068 -2.4526339 debye
polarizability: 318.9185026|-51.2290756|214.089197|12.7328033|2.5204652|234.5012464 unknown
InChI: InChI=1S/C22H18N2O2/c1-14-23-21(16-8-3-2-4-9-16)19(22(26)24-14)13-18-17-10-6-5-7-15(17)11-12-20(18)25/h2-12,23,25H,13H2,1H3
charge 0 multiplicity 1
44 atoms
O  -0.715912 2.431657 -1.001575
O  -2.853756 2.271147 2.113268
N  -3.15104 -0.867931 -0.423078
N  -4.178833 0.968309 0.687853
C  -0.387166 1.074864 1.408131
C  0.763905 1.177703 0.416265
C  -1.711157 0.54295 0.874041
C  2.084317 0.652417 0.67876
C  -1.861087 -0.56719 0.059494
C  3.141602 0.824231 -0.30575
C  0.56495 1.886546 -0.782202
C  -0.799641 -1.504753 -0.406256
C  -2.921482 1.317901 1.277598
C  2.425405 -0.035663 1.895536
C  2.864941 1.532196 -1.518065
C  1.598721 2.060668 -1.752235
C  -4.255631 -0.079716 -0.114135
C  4.449603 0.295452 -0.050713
C  3.710488 -0.534004 2.120293
C  4.737365 -0.37602 1.137643
C  0.046917 -2.168041 0.517637
C  -0.668575 -1.79712 -1.791852
C  -5.572031 -0.48075 -0.739582
C  1.014677 -3.090684 0.067215
C  0.299972 -2.719926 -2.241601
C  1.144786 -3.370491 -1.312353
H  -0.088994 0.48806 2.293986
H  -0.633345 2.082433 1.800826
H  -3.269062 -1.710972 -0.989746
H  1.67127 -0.160311 2.678732
H  3.663909 1.659759 -2.257173
H  1.388558 2.614495 -2.677001
H  5.227637 0.435858 -0.811044
H  3.937942 -1.04513 3.062694
H  5.741181 -0.771892 1.32569
H  -0.061292 -1.967485 1.588282
H  -1.296281 -1.268292 -2.519671
H  -5.872217 -1.501428 -0.435544
H  -5.521021 -0.455119 -1.84435
H  -6.342975 0.226713 -0.40411
H  -0.720863 3.012819 -1.801841
H  1.669121 -3.586021 0.792286
H  0.403091 -2.922741 -3.31332
H  1.900006 -4.083601 -1.660337
