program: Gaussian 09
title: 000270270
version: EM64L-G09RevD.01
frameworkgroup: C1[X(C8H13N3OS)]
method: RPBEPBE
basis: SDD
operation: Freq
keyword: #p
keyword: freq=noraman
keyword: PBEPBE/SDD
title: #p freq=noraman PBEPBE/SDD
converged: YES YES NO NO
title: Mulliken charges:
elementType: S O N N N C C C C C C C C H H H H H H H H H H H H H
charge: -0.021386 -0.248346 -0.428197 -0.039290 -0.629415 -0.519919 0.107637 -0.318154 0.286668 -0.727492 -0.031624 -0.800851 0.140794 0.187105 0.247190 0.195332 0.266408 0.281409 0.252179 0.305300 0.245264 0.261554 0.238205 0.084895 0.356092 0.308643
chargesum: 0.00000
title: Mulliken charges with hydrogens summed into heavy atoms:
elementType: S O N N N C C C C C C C C
charge: 0.063509 -0.248346 -0.122897 -0.039290 0.035320 -0.085624 0.107637 0.143586 0.286668 -0.193904 -0.031624 -0.055828 0.140794
polarizability: 1.70251021e+02 -1.23049043e+01 1.30294755e+02 1.00046267e+01 -6.84663555e+00 8.76418604e+01
1716.lowfreq: -6.3512 -2.9585 -0.0011 0.0003 0.0014 8.9094 27.5211 39.9381 62.7927
frequency: 27.2779 39.8606 62.7669 75.5985 89.2915 106.7953 166.1469 177.7855 192.6364 216.3926 219.1265 270.7636 298.8717 333.0653 357.8930 419.1525 491.7640 511.5020 515.6803 553.7264 561.2648 575.2418 609.2303 670.3837 697.0295 730.8967 752.8631 771.5375 796.9301 859.9349 925.6358 943.7917 1008.3342 1035.9794 1045.5498 1050.0204 1059.4017 1103.7749 1154.1822 1176.6029 1216.0428 1238.1556 1265.4835 1288.6596 1302.0991 1322.2395 1335.8511 1379.7448 1403.3041 1447.3422 1449.2473 1458.7075 1468.3973 1471.2084 1479.2141 1561.8404 1591.6625 1634.9701 1662.3739 2427.8100 2973.7077 2980.0903 2989.4991 3019.0654 3043.7532 3044.9083 3066.3367 3097.9780 3128.9995 3535.7030 3554.0466 3706.5548
redmass: 5.6137 5.5158 1.6081 1.0900 5.0585 2.8960 3.0322 4.9735 1.2042 4.5203 1.1994 6.1089 2.8574 2.3420 4.4454 4.6408 5.4478 1.1299 6.2993 1.7671 2.0900 3.6151 6.3298 3.8951 9.0814 1.1554 2.4075 2.5141 3.3149 1.3711 1.8586 3.1220 4.2128 1.7944 1.5466 1.8796 3.0842 1.7639 2.1139 2.3174 4.0651 1.2091 1.3134 1.1171 1.3755 1.6250 1.4062 2.5739 1.4708 1.2451 1.3051 1.8859 1.1008 1.1422 1.0917 6.8505 1.5157 2.4395 6.6415 1.0383 1.0410 1.0639 1.0612 1.0594 1.0980 1.0960 1.1002 1.1065 1.0939 1.0771 1.0459 1.1052
irintensity: 4.2119 3.7930 1.2983 0.0437 2.7921 4.2998 0.7645 0.6368 24.2866 5.3602 67.2177 1.8709 4.4474 1.4945 5.3596 8.4775 0.9228 340.8960 4.9790 2.9011 20.4382 3.2904 0.5517 8.0216 7.3835 4.0474 5.1489 9.7189 2.7687 3.7736 2.4608 12.9850 0.8786 1.8976 4.2253 16.8839 16.8130 7.1619 6.6249 13.6053 14.9629 9.9665 9.6274 14.5756 47.9214 34.3280 1.2406 30.0913 37.1616 28.9782 32.9377 141.3847 18.0735 31.9542 25.8320 488.5771 10.5037 389.4828 216.3272 34.9431 27.6957 17.9619 39.6298 34.2662 16.1867 4.3002 6.6388 22.3394 10.0905 19.9203 97.4590 41.2527
temp: 298.150 k
press: 1.00000 atm
elementType: 16 8 7 7 7 6 6 6 6 6 6 6 6 1 1 1 1 1 1 1 1 1 1 1 1 1
symmnumber: 1
zpe: 539513.9 jmol-1
zpe.correction: 0.205490 hartree
zpe.thermalcorrener: 0.220369 hartree
zpe.thermalcorrenthalpy: 0.221313 hartree
zpe.thermalcorrgfe: 0.161946 hartree
zpe.sumelectzpe: -949.204847 hartree
zpe.sumelectthermal: -949.189968 hartree
zpe.sumelectthermalent: -949.189023 hartree
zpe.sumelectthermalfe: -949.248390 hartree
dipole: -5.8713 8.7921 -1.1584
dipole: 10.6356
quadrupole: -71.0668 -89.9737 -85.1636
quadrupole: -7.0281 11.0615 -0.2193
quadrupole: 11.0012 -7.9057 -3.0955 -7.0281 11.0615 -0.2193
hfenergy: -949.4103366 hartree
pointgroup: C01 [X(C8H13N3O1S1)]
dipole: 2.2178151 -3.5466353 0.1074407 debye
dipolederiv: -0.4161191 -0.0993233 -0.0070396 -0.175763 0.1010847 -0.0052298 -0.0957461 0.0625592 -0.2260753 -0.7892759 0.2769237 0.0645062 0.341879 -1.0372179 -0.0758334 0.0694604 -0.041373 -0.3851523 -1.0235932 0.0838042 0.1405631 -0.436655 -0.7468836 0.1328215 0.267918 0.0006702 -0.276732 -1.3639434 0.3213366 0.2406923 0.4302058 -0.6648178 -0.1074001 0.2643936 -0.0613999 -0.3693345 -1.5940144 -0.0258467 0.1837418 -0.0472362 -0.2196407 -0.0280914 0.2452106 -0.0292168 -0.807192 -0.1798626 0.0202681 -0.0786961 -0.0094392 0.1148543 -0.0340751 -0.0664975 -0.0437751 0.1249443 0.0867588 -0.1175793 0.0137611 0.0628955 -0.6887633 0.0335823 -0.0853838 0.0846188 -0.1109169 -0.0478444 -0.016387 0.024261 -0.0035836 0.1239724 0.0303989 0.0353212 0.0174055 -0.0537309 0.7287642 -0.277234 -0.1794739 0.0066618 0.5084333 -0.0416581 -0.2361893 0.0701832 0.0157096 0.3359077 -0.0066534 0.1328207 0.0789953 0.0901136 0.0538804 0.1450421 -0.0442157 0.2854304 1.3036304 -0.2755046 -0.2531257 -0.3511558 1.3116398 0.042419 -0.2612231 -0.0137317 0.2609351 -0.0358861 -0.0169154 0.0494841 -0.1063938 -0.1204077 0.0349543 0.0480077 -0.0129974 0.084222 1.9828428 -0.100274 -0.4228678 -0.0353537 1.077095 0.0022945 -0.4808347 -0.0232874 0.36179 -0.0062742 -0.0386503 0.039172 -0.0753124 -0.0645168 0.1519383 0.0234051 0.0918773 -0.0245791 0.0941794 0.0203572 0.0205439 0.0836848 0.0036109 -0.1063848 0.0003871 -0.0393387 0.0354342 0.0140718 0.0337314 -0.0070365 0.0121157 -0.0903346 -0.1186713 0.0182311 -0.0861832 -0.0031568 0.0819377 -0.0321416 0.0295695 -0.0129971 0.0019435 0.0785817 0.0724988 0.0519048 0.0073967 0.057755 0.0019385 -0.0304567 0.0564682 -0.0304067 -0.0820438 0.0000233 -0.0729093 0.0249657 -0.0226499 -0.0011598 -0.0484673 -0.0527493 -0.0288182 0.1297085 -0.0013488 0.0922756 -0.1008921 0.1521816 0.0155972 0.0456893 0.0144119 0.1163425 0.0025926 0.0496246 0.0075876 0.3068202 0.1061265 0.0039062 0.0235748 0.0009811 -0.0213415 -0.0544154 0.0216686 -0.1227262 -0.0589129 -0.0638046 -0.0518955 0.063336 0.0106484 0.1218857 -0.0230781 0.0637358 0.0160103 0.0834148 0.0033971 0.0942443 -0.1077638 0.0432309 -0.0114996 0.0631205 -0.0918512 0.1006012 0.0144359 0.084548 0.1353741 -0.0198964 0.0815548 -0.1530536 -0.0905603 -0.0761354 -0.0219625 0.0433927 0.2710324 0.043369 0.0358579 0.0794604 0.1903145 -0.0050262 0.0295213 0.0008983 0.3847613 0.2401346 0.0087144 0.0472503 0.0034454 0.1164118 0.0161752 0.0407608 0.0165249 0.383022 unknown
polarizability: 170.4020082|-14.444623|131.9707626|-1.1313398|1.1866818|85.8148653 unknown
InChI: InChI=1S/C8H13N3OS/c1-5-6(3-2-4-13)7(12)11-8(9)10-5/h10,13H,2-4,9H2,1H3
charge 0 multiplicity 1
26 atoms
S  -5.045039 0.140015 -1.397356
O  0.010797 2.299334 0.29493
N  2.125594 -1.158332 -0.070555
N  2.03981 1.233803 -0.183608
N  4.030726 0.115815 -0.684399
C  -1.423292 -0.070701 0.887798
C  0.036247 -0.106813 0.486393
C  -2.36917 -0.048284 -0.349894
C  0.773899 -1.262687 0.331805
C  -3.838887 0.105563 0.070048
C  0.673982 1.220225 0.199196
C  0.295459 -2.681596 0.535436
C  2.70079 0.09123 -0.304957
H  -1.689268 -0.918054 1.548647
H  -1.584291 0.8646 1.45527
H  -2.237242 -0.980716 -0.935446
H  -2.082723 0.794454 -1.003891
H  -4.005464 1.074159 0.571597
H  -4.158148 -0.699262 0.755201
H  2.667797 -2.016187 -0.18524
H  0.326956 -3.252831 -0.412805
H  -0.740124 -2.700734 0.901623
H  0.925851 -3.216033 1.272576
H  -4.774158 -1.147821 -1.835518
H  4.428527 1.036577 -0.854325
H  4.607267 -0.713922 -0.790926
