program: Gaussian 09
title: 000270269
version: EM64L-G09RevD.01
frameworkgroup: C1[X(C13H16BrNO3)]
method: RPBEPBE
basis: SDD
operation: Freq
keyword: #p
keyword: freq=noraman
keyword: PBEPBE/SDD
title: #p freq=noraman PBEPBE/SDD
converged: YES YES NO NO
title: Mulliken charges:
elementType: Br O O O N C C C C C C C C C C C C C H H H H H H H H H H H H H H H H
charge: -0.041400 -0.260853 -0.441814 -0.253775 -0.341111 -0.378547 -0.353879 -0.564231 -0.408471 0.517671 -0.409004 -0.394595 -0.353300 -0.331007 0.246715 0.288842 -0.739736 0.110735 0.208191 0.221334 0.206076 0.233182 0.215620 0.209043 0.258672 0.215780 0.238865 0.238519 0.318394 0.269597 0.273240 0.307311 0.310245 0.383688
chargesum: 0.00000
title: Mulliken charges with hydrogens summed into heavy atoms:
elementType: Br O O O N C C C C C C C C C C C C C
charge: -0.041400 -0.260853 -0.058125 -0.253775 -0.022717 0.050979 0.085379 -0.139567 0.065981 0.517671 -0.170139 -0.156076 -0.083703 -0.057767 0.246715 0.288842 -0.122180 0.110735
polarizability: 2.09673626e+02 3.58195047e+01 1.88583918e+02 3.27405188e+01 -7.50630188e+00 1.25612060e+02
1716.lowfreq: -10.8050 -0.0002 0.0006 0.0007 2.1012 3.5025 10.6700 12.9974 18.8647
frequency: 9.8866 12.4868 18.5003 34.2403 41.7793 72.1765 73.3975 102.3079 111.4856 138.7329 153.2789 184.9994 220.7214 227.1791 285.0086 317.5378 336.0539 359.1905 380.8761 405.6511 462.6100 487.4058 516.9281 565.1948 580.5146 594.4397 603.0534 621.5415 631.9934 633.5629 690.5401 709.2103 742.5124 762.2591 799.5207 815.3214 855.0668 862.1016 869.0967 871.5667 914.7116 963.0516 987.6569 996.2760 1001.4597 1020.7146 1031.6445 1062.1459 1084.7169 1101.0658 1123.3602 1139.2555 1151.0421 1153.8629 1194.0286 1217.4582 1222.2161 1232.4594 1255.9432 1258.6007 1285.5487 1297.0457 1311.0738 1321.7339 1328.4635 1348.5018 1367.9576 1387.4896 1411.9436 1413.4570 1452.7076 1462.0904 1470.7086 1486.5054 1500.7277 1506.1171 1575.4696 1605.3093 1620.2602 1642.5141 2966.9044 2979.3846 2984.6021 3005.3780 3013.1686 3038.6433 3054.9367 3068.8560 3076.5660 3125.2693 3127.9228 3151.1971 3159.9532 3175.4210 3516.4193 3532.5770
redmass: 10.8587 5.4349 7.1497 5.6631 7.0453 3.3648 5.9412 2.2952 5.8608 2.5852 4.2006 4.8106 5.2020 3.9682 3.7301 6.3905 2.6917 3.6646 5.3025 2.8542 2.8074 5.6217 2.6775 3.2153 3.0786 1.4472 3.4319 4.7156 5.6868 1.1982 3.7130 3.9207 1.2273 3.9049 1.7705 4.6484 1.5985 1.3767 1.6826 1.7233 2.7359 2.2668 1.3699 1.3778 4.7062 2.9423 3.1649 1.6419 2.7273 3.6742 1.3924 1.1419 1.6932 1.3507 1.1682 2.3591 1.2860 1.3294 1.6335 1.4288 1.1251 1.2559 1.3426 2.5120 1.3799 1.4377 1.3323 5.2885 3.2223 1.0979 1.1083 1.0781 1.0971 1.1079 2.6632 1.9802 7.1441 7.8025 6.3327 8.5894 1.0592 1.0606 1.0597 1.0655 1.0953 1.1011 1.1034 1.0567 1.1041 1.0897 1.0897 1.1088 1.0954 1.0949 1.0781 1.0641
irintensity: 0.2913 0.5132 1.3203 1.4151 1.1510 14.6902 0.6963 1.1252 1.0639 1.6459 5.8855 1.1209 3.7565 0.5220 1.3202 2.9688 0.3791 13.6811 11.1564 0.3647 6.7354 7.5154 53.7324 0.8640 55.7922 55.9683 8.7337 84.6856 4.0137 111.6329 60.1228 28.0817 10.7684 10.9942 7.3801 0.9660 14.3437 8.5646 8.6982 18.7312 8.1200 1.4692 1.5186 0.2255 190.0642 84.8073 22.3729 5.0494 17.9441 7.2747 5.9493 1.4867 126.4801 2.6186 2.9401 0.0121 27.8948 11.4524 14.9554 11.7988 0.7753 35.7723 19.5901 96.4384 9.2457 3.5365 7.9394 4.8123 15.4003 33.6265 32.0162 3.2957 1.7996 19.4238 16.8793 217.8991 16.6624 225.6564 65.3489 310.8012 5.0763 4.0273 75.9063 26.5030 2.1706 1.1012 76.7343 2.2267 14.0958 14.6920 12.5844 0.0946 5.3966 1.6882 43.3594 46.4296
temp: 298.150 k
press: 1.00000 atm
elementType: 35 8 8 8 7 6 6 6 6 6 6 6 6 6 6 6 6 6 1 1 1 1 1 1 1 1 1 1 1 1 1 1 1 1
symmnumber: 1
zpe: 706062.5 jmol-1
zpe.correction: 0.268925 hartree
zpe.thermalcorrener: 0.287653 hartree
zpe.thermalcorrenthalpy: 0.288597 hartree
zpe.thermalcorrgfe: 0.215225 hartree
zpe.sumelectzpe: -797.553596 hartree
zpe.sumelectthermal: -797.534869 hartree
zpe.sumelectthermalent: -797.533924 hartree
zpe.sumelectthermalfe: -797.607296 hartree
dipole: 0.6929 0.3780 -0.3957
dipole: 0.8829
quadrupole: -143.4287 -111.9514 -115.6258
quadrupole: -1.1724 -10.8500 -8.7037
quadrupole: -19.7601 11.7172 8.0428 -1.1724 -10.8500 -8.7037
hfenergy: -797.8225212 hartree
pointgroup: C01 [X(C13H16Br1N1O3)]
dipole: 0.2847798 -0.149779 0.1308559 debye
polarizability: 224.4795153|-19.5247936|180.3274016|-33.3845567|5.0753805|119.0626874 unknown
InChI: InChI=1S/C13H16BrNO3/c14-9-12(16)15-8-2-1-3-10-4-6-11(7-5-10)13(17)18/h4-7,15,17H,1-3,8-9H2
charge 0 multiplicity 1
34 atoms
Br 4.026933 3.015071 1.774479
O  5.649299 -0.127313 -0.545055
O  -5.279965 2.033935 -0.072058
O  -6.027159 0.052074 0.878889
N  3.935512 -0.088519 1.041075
C  1.173321 -1.210624 0.103892
C  2.562898 -1.814926 -0.18944
C  0.144669 -1.519793 -1.021372
C  3.613558 -1.522905 0.908026
C  -1.229784 -0.947323 -0.717545
C  -2.218098 -1.734041 -0.067257
C  -1.54122 0.402164 -1.034528
C  -3.475163 -1.192596 0.260891
C  -2.795771 0.954613 -0.711807
C  -3.772048 0.157941 -0.058755
C  4.924884 0.494019 0.297014
C  5.22162 1.985109 0.476743
C  -5.110666 0.688475 0.302355
H  0.786074 -1.604666 1.065859
H  1.255998 -0.111645 0.221289
H  2.4745 -2.915728 -0.291443
H  2.949114 -1.437515 -1.156073
H  0.530697 -1.1057 -1.973344
H  0.079213 -2.617766 -1.149967
H  4.553679 -2.04807 0.663558
H  3.255466 -1.885931 1.889539
H  -1.996936 -2.780046 0.176954
H  -0.79227 1.020394 -1.544328
H  3.397872 0.499097 1.683534
H  -4.242182 -1.7946 0.759351
H  -3.033935 1.992509 -0.960705
H  5.115289 2.501477 -0.488578
H  6.244931 2.113351 0.860214
H  -6.192429 2.323677 0.197395
