program: Gaussian 09
title: 000270268
version: EM64L-G09RevD.01
frameworkgroup: C1[X(C11H11NO2)]
method: RPBEPBE
basis: SDD
operation: Freq
keyword: #p
keyword: freq=noraman
keyword: PBEPBE/SDD
title: #p freq=noraman PBEPBE/SDD
converged: YES YES NO NO
title: Mulliken charges:
elementType: O O N C C C C C C C C C C C H H H H H H H H H H H
charge: -0.440894 -0.252297 -0.019449 -0.569295 -0.385114 0.513836 -0.434290 -0.397128 -0.398109 0.247917 -0.353190 -0.325953 0.112867 -0.139463 0.207667 0.247120 0.234687 0.233283 0.259235 0.246366 0.237663 0.244557 0.270633 0.274736 0.384615
chargesum: 0.00000
title: Mulliken charges with hydrogens summed into heavy atoms:
elementType: O O N C C C C C C C C C C C
charge: -0.056279 -0.252297 -0.019449 -0.114509 0.082856 0.513836 0.071312 -0.159465 -0.153552 0.247917 -0.082557 -0.051217 0.112867 -0.139463
polarizability: 1.90719421e+02 4.45536338e+00 1.26642116e+02 -1.00972133e+01 -5.61575479e-01 7.08845911e+01
1716.lowfreq: 0.0003 0.0006 0.0008 3.8203 7.9038 9.2495 22.1558 33.4788 52.6190
frequency: 22.1431 33.4599 52.5982 74.0171 86.6863 154.7218 181.4213 195.0004 266.3660 309.1232 337.7465 369.7470 382.9371 406.2265 486.1910 504.8457 545.6588 586.0514 599.8530 633.6454 689.6910 709.5172 756.9002 765.9236 809.8085 845.2174 863.0036 868.5662 874.9632 987.7397 997.0197 1001.4560 1011.0921 1023.3547 1037.7086 1060.7445 1117.3256 1150.4302 1154.1566 1194.8279 1209.1241 1219.6631 1273.1069 1299.7981 1311.9482 1316.8883 1322.1069 1348.1412 1388.8347 1412.7784 1445.7313 1466.8051 1484.6273 1502.7542 1576.9007 1621.5715 1643.2221 2196.4980 2985.1366 2993.9553 3002.6311 3038.0659 3051.1957 3072.1537 3126.0461 3130.9424 3161.5157 3176.9489 3531.8166
redmass: 4.6626 6.8417 4.9011 6.6996 5.7186 4.8398 3.6881 2.9196 5.4719 4.1865 2.7862 3.4264 5.3137 2.8570 5.3499 3.1062 4.8464 1.8149 1.9333 6.8966 3.7987 3.3930 2.0567 2.2815 3.0321 2.9883 1.3509 1.5964 2.0297 1.3869 1.3779 4.4275 2.5697 2.6440 2.0067 3.0413 1.3838 1.7052 1.1603 1.1719 1.1936 2.5969 1.2647 1.2995 1.3651 1.3269 2.5121 1.3973 5.3493 3.1611 1.0872 1.0814 1.1045 2.6831 7.1377 6.3555 8.6319 12.4215 1.0597 1.0592 1.0612 1.1007 1.1004 1.1047 1.0894 1.0904 1.0953 1.0950 1.0642
irintensity: 5.6599 3.3289 1.6021 0.4472 3.7322 0.5223 0.6274 1.1512 2.8751 1.3507 0.3192 0.6233 9.5818 0.3598 12.3735 41.0688 6.2992 70.6108 42.5755 0.5873 57.5440 33.3780 8.1147 5.8833 4.1249 5.8606 0.1605 5.1981 28.1399 2.0719 0.0619 192.7251 12.9613 91.5060 13.4472 4.8552 2.4797 123.7468 4.5999 2.9457 7.2710 0.2314 0.4425 1.8597 19.5578 1.8015 101.0657 4.6281 2.7802 17.9555 17.1987 2.6682 11.5098 12.6150 17.7206 66.2622 311.2070 10.2011 14.7365 16.0008 28.7601 1.9001 8.3941 31.0950 12.9667 11.3855 4.8032 1.3964 47.5819
temp: 298.150 k
press: 1.00000 atm
elementType: 8 8 7 6 6 6 6 6 6 6 6 6 6 6 1 1 1 1 1 1 1 1 1 1 1
symmnumber: 1
zpe: 511157.1 jmol-1
zpe.correction: 0.194689 hartree
zpe.thermalcorrener: 0.207987 hartree
zpe.thermalcorrenthalpy: 0.208932 hartree
zpe.thermalcorrgfe: 0.152342 hartree
zpe.sumelectzpe: -629.962779 hartree
zpe.sumelectthermal: -629.949481 hartree
zpe.sumelectthermalent: -629.948537 hartree
zpe.sumelectthermalfe: -630.005127 hartree
dipole: 0.2364 -1.9623 1.4038
dipole: 2.4243
quadrupole: -99.6193 -80.8343 -82.5568
quadrupole: -25.6379 5.6866 2.0246
quadrupole: -11.9492 6.8358 5.1133 -25.6379 5.6866 2.0246
hfenergy: -630.1574688 hartree
pointgroup: C01 [X(C11H11N1O2)]
dipole: 0.0771202 0.7862256 -0.5344078 debye
dipolederiv: -0.6191398 -0.3972251 -0.0616782 -0.588779 -1.0722666 -0.1396503 -0.0969663 -0.1294512 -0.4514882 -1.1158225 0.2647553 -0.0467863 0.2332907 -0.7488571 -0.0287402 -0.0691742 -0.0179371 -0.3432677 -0.2972785 0.0115632 0.0007839 0.1039518 -0.2476028 0.0048976 -0.026647 0.0039366 -0.2391831 -0.1630736 -0.0202763 0.0291368 -0.0560117 0.1410479 0.0279346 0.2224231 0.0538614 0.0702807 0.1741962 -0.0489995 0.0083256 0.0407677 0.0856199 0.0263795 -0.193557 -0.0130081 0.1023157 0.5389783 0.0363921 0.0062669 0.0648881 0.0759468 0.0108982 0.0421314 0.0090744 -0.0550161 0.0153502 0.0509614 -0.0097795 0.0368311 0.100673 0.0686877 0.0818355 0.0906251 0.1718792 -0.3529004 0.1093804 0.0231031 0.1789587 0.0649137 0.0481738 0.0119071 0.0422437 -0.1502937 -0.2796391 -0.1698596 -0.0057478 -0.275229 -0.0206125 -0.0046878 -0.0408933 -0.0059059 -0.1559017 -0.8194983 -0.0869278 -0.0791652 -0.0830999 -0.0820884 -0.0157608 -0.1119573 -0.0199751 -0.019406 0.1737107 -0.0861568 0.0152967 0.1578407 0.0351609 0.0350125 0.0554402 0.0085606 -0.0934091 0.2112313 0.1133393 0.0433786 -0.1108499 0.0267616 0.0002973 0.0266758 0.0290069 -0.0940055 2.0779777 0.123898 0.2041084 0.2731932 1.4069039 0.1720009 0.2649924 0.160031 0.2789834 -0.0260657 -0.0854499 0.0225997 -0.1964178 0.096573 -0.0632752 0.0541292 -0.069768 -0.0275975 0.0056682 -0.0270661 -0.0178157 -0.0613983 -0.0586352 -0.1240318 -0.0413662 -0.0734647 -0.0131834 0.0180083 0.0244699 -0.0342451 0.0689871 -0.0487312 0.0857462 -0.0462043 0.044125 0.0350856 0.0431717 -0.0418635 -0.0133555 -0.0447067 -0.0269062 -0.1173872 -0.019199 -0.0661023 -0.0132581 -0.0000912 0.0923994 -0.0384364 0.0562348 -0.0620448 0.1031755 -0.0201579 0.0609383 0.0239028 -0.0330135 0.0069417 0.0678802 0.0248469 0.0753021 0.0314478 0.0788571 0.060047 -0.0261323 0.0773063 0.0174533 -0.0368155 0.0000942 -0.0251054 -0.0506698 -0.091899 -0.0923042 0.0262076 0.0436209 -0.0902052 -0.0322116 -0.0885619 -0.0596856 -0.0344928 -0.033271 -0.0359202 0.1331195 0.0012034 0.1003375 -0.0130182 0.1046845 -0.0090655 -0.0101559 -0.0139058 -0.0066763 0.1375458 0.0646551 0.0803288 0.0017634 0.0539597 0.0306497 -0.0101142 -0.0066926 -0.0069636 0.1528062 0.0995144 -0.0437957 -0.0108473 -0.0471918 0.0025445 -0.022782 -0.0153478 -0.0233529 0.1523646 0.1619298 0.065605 -0.0227409 0.1537169 0.3195044 0.0070963 -0.0111532 -0.0016207 0.3976514 unknown
polarizability: 190.8769286|-3.3721317|126.4736989|10.0193974|0.9213034|70.8955014 unknown
InChI: InChI=1S/C11H11NO2/c12-8-2-1-3-9-4-6-10(7-5-9)11(13)14/h4-7,13H,1-3H2
charge 0 multiplicity 1
25 atoms
O  -4.283566 -1.500595 -0.396316
O  -4.68755 0.774471 -0.166774
N  5.338911 -1.35024 0.311289
C  1.905307 0.421994 0.576165
C  2.607271 0.656747 -0.790111
C  0.403619 0.250799 0.413161
C  4.146872 0.831564 -0.657155
C  -0.463951 1.375426 0.444421
C  -0.158248 -1.033147 0.18343
C  -2.398578 -0.062481 0.017671
C  -1.849781 1.225657 0.249376
C  -1.543942 -1.194636 -0.012852
C  -3.866235 -0.17514 -0.180803
C  4.814638 -0.368974 -0.120974
H  2.121766 1.280907 1.241014
H  2.343151 -0.476003 1.051687
H  2.389022 -0.187726 -1.469415
H  2.198504 1.567833 -1.266336
H  4.587497 1.064451 -1.645067
H  4.375499 1.686159 0.008943
H  -0.047073 2.372583 0.631181
H  0.49787 -1.91167 0.166795
H  -2.525411 2.086943 0.276347
H  -1.975329 -2.184519 -0.185267
H  -5.270461 -1.505501 -0.519509
