program: Gaussian 09
title: 000275822
version: EM64L-G09RevD.01
frameworkgroup: C1[X(C22H17ClO2S)]
method: RPBEPBE
basis: SDD
operation: Freq
keyword: #p
keyword: freq=noraman
keyword: PBEPBE/SDD
title: #p freq=noraman PBEPBE/SDD
converged: YES YES NO NO
title: Mulliken charges:
elementType: Cl S O O C C C C C C C C C C C C C C C C C C C C C C H H H H H H H H H H H H H H H H H
charge: -0.085528 0.892601 -0.531980 -0.538024 -0.552685 -0.353595 -0.534666 0.393075 -0.604855 0.416903 0.382624 0.412086 -0.451673 -0.447212 -0.446969 -0.021050 -0.359728 -0.227469 -0.223044 -0.230073 -0.248144 -0.276503 -0.254182 -0.205020 -0.207687 -0.218033 0.346394 0.336767 0.320256 0.314496 0.249860 0.243935 0.243183 0.253998 0.227664 0.227501 0.232754 0.234179 0.289092 0.282605 0.240227 0.241032 0.236888
chargesum: 0.00000
title: Mulliken charges with hydrogens summed into heavy atoms:
elementType: Cl S O O C C C C C C C C C C C C C C C C C C C C C C
charge: -0.085528 0.892601 -0.531980 -0.538024 -0.206291 -0.016828 -0.214410 0.393075 -0.290360 0.416903 0.382624 0.412086 -0.201813 -0.203277 -0.203785 -0.021050 -0.105729 0.000195 0.004457 0.002681 -0.013965 0.012589 0.028423 0.035207 0.033345 0.018855
polarizability: 2.87153563e+02 -2.68860353e+01 2.56749739e+02 1.34460295e+01 1.75189904e+00 2.58299492e+02
1716.lowfreq: -12.1935 -7.3764 -4.8333 -0.0015 -0.0013 -0.0012 14.1810 29.2612 32.3186
frequency: 13.6972 29.2257 32.3097 51.7576 61.2799 84.1497 99.6947 101.6318 136.0199 150.4724 156.6301 180.4633 187.3104 220.5071 240.5368 244.0215 277.0332 313.0262 342.0380 344.2271 367.0560 403.1815 406.7464 423.8017 436.7534 454.9313 465.5592 499.0760 523.1533 545.2931 554.2436 583.4580 595.5769 603.4099 629.8037 655.3682 659.1663 693.6310 701.1079 730.4809 731.9045 752.6267 761.3744 764.3956 775.2389 791.8082 800.5996 848.2967 852.2724 854.6157 882.4786 888.2365 891.9158 916.6498 936.0376 941.5482 951.2531 957.5975 979.8792 984.3881 988.8937 993.6801 1005.1443 1005.7031 1008.8678 1018.7227 1024.5264 1044.4255 1049.2520 1075.3784 1080.4574 1099.7111 1144.2702 1158.2465 1169.1461 1170.9042 1172.6804 1175.8100 1176.6641 1179.6773 1183.5431 1188.2665 1202.0499 1217.6933 1241.4894 1261.7110 1273.8337 1299.7228 1301.1088 1304.9466 1322.7642 1378.3832 1383.2069 1398.4522 1435.3782 1442.5674 1450.2679 1452.5253 1466.2948 1476.3036 1578.5608 1581.6069 1603.9535 1604.0410 1610.4466 1619.5095 3075.6205 3078.2656 3083.9060 3088.4495 3125.2642 3128.2766 3131.7833 3135.7314 3137.1817 3145.3053 3146.0780 3148.9640 3153.7740 3162.6300 3165.2760 3166.0016 3173.2234
redmass: 5.9575 6.0004 4.5094 6.5333 7.2803 7.3293 6.3374 5.0914 4.6170 6.8721 6.4553 7.8212 5.8126 9.9316 7.4101 8.3580 6.7174 4.5392 5.3372 5.3324 10.0372 2.8471 3.9834 4.5480 4.8950 4.1744 4.8592 4.6787 4.2736 4.5124 6.4202 4.6137 5.9776 6.4753 5.5573 5.3593 5.6539 2.3970 4.7016 4.7160 3.5981 2.7715 1.4938 1.6157 1.6089 4.5854 4.7092 3.4584 3.5351 1.2530 1.4874 2.5525 2.1020 14.7953 1.4442 2.7877 1.4471 1.4211 5.8697 1.3940 1.3305 1.3416 1.3447 2.6371 4.0039 2.2470 2.2023 1.9041 2.1591 1.5601 2.8556 2.2190 1.2062 1.7986 1.4441 1.1026 1.0673 1.1547 1.1284 1.3554 1.3614 1.5380 1.6385 2.1940 1.5102 1.9793 1.6349 1.4702 1.3169 1.4622 1.5989 7.3172 8.3756 6.3886 2.2398 2.3744 2.4239 2.0435 2.6566 2.5553 5.8350 6.5574 6.9352 6.9486 6.5424 7.2937 1.0867 1.0866 1.0871 1.0899 1.0864 1.0855 1.0894 1.0856 1.0900 1.0882 1.0942 1.0952 1.0925 1.0969 1.1004 1.1006 1.1016
irintensity: 2.1225 1.6763 0.3754 1.1256 0.2034 0.8015 2.0682 0.3262 0.2515 1.1038 0.1409 8.4001 6.2890 3.7005 6.6752 7.2777 6.1346 4.2783 1.1197 0.4917 14.7885 0.1304 4.8925 12.0095 59.3719 17.8306 10.1083 103.0983 15.6253 2.4675 22.0463 4.0511 10.7180 0.0611 3.5978 21.9272 32.5280 32.2101 9.7423 3.0182 2.6203 40.9292 73.4026 61.3113 44.4396 20.6478 14.9165 3.4314 1.4569 0.3157 0.4429 0.9563 0.7405 59.7575 1.8400 13.6655 0.7455 0.8540 2.1844 0.0403 0.0100 0.0516 0.1788 3.6685 2.3032 4.4761 1.2595 4.2909 25.4726 5.7521 0.5120 16.9076 14.9952 0.4904 3.9642 1.0545 0.8490 6.0553 2.9243 0.0077 7.9575 10.6086 4.5623 0.5563 17.2327 10.1238 4.5758 3.8065 3.2545 7.8564 9.7394 0.4427 4.3980 0.7736 15.1717 11.5357 6.5898 15.2318 20.3415 11.9398 5.6094 2.0699 0.5424 0.2189 10.7075 1.2659 2.7680 1.2339 9.2707 2.2179 2.6665 0.0785 1.8075 0.9711 5.2542 8.7286 15.1956 23.4940 1.2026 6.3300 35.8684 28.6861 32.3272
temp: 298.150 k
press: 1.00000 atm
elementType: 17 16 8 8 6 6 6 6 6 6 6 6 6 6 6 6 6 6 6 6 6 6 6 6 6 6 1 1 1 1 1 1 1 1 1 1 1 1 1 1 1 1 1
symmnumber: 1
zpe: 853699.8 jmol-1
zpe.correction: 0.325157 hartree
zpe.thermalcorrener: 0.346889 hartree
zpe.thermalcorrenthalpy: 0.347833 hartree
zpe.thermalcorrgfe: 0.272363 hartree
zpe.sumelectzpe: -1855.163994 hartree
zpe.sumelectthermal: -1855.142262 hartree
zpe.sumelectthermalent: -1855.141318 hartree
zpe.sumelectthermalfe: -1855.216789 hartree
dipole: -1.3159 -4.1314 -1.4403
dipole: 4.5689
quadrupole: -139.0343 -174.5032 -154.3698
quadrupole: -14.0794 -0.7022 6.1345
quadrupole: 16.9348 -18.5341 1.5993 -14.0794 -0.7022 6.1345
hfenergy: -1855.4891513 hartree
pointgroup: C01 [X(C22H17Cl1O2S1)]
dipole: -0.7497235 -1.624608 -0.172388 debye
polarizability: 284.0306504|-26.6885429|263.9289932|15.8779754|2.1670375|254.2431501 unknown
InChI: InChI=1S/C22H17ClO2S/c23-21-18-13-7-6-12-17(18)19-15-10-4-5-11-16(15)20(21)22(19)26(24,25)14-8-2-1-3-9-14/h1-13,19-22H
charge 0 multiplicity 1
43 atoms
Cl -0.199161 -1.790904 2.985687
S  1.842183 1.098167 -0.314056
O  2.18355 2.157697 0.88983
O  1.606669 1.582766 -1.864083
C  0.28448 0.015557 0.237624
C  -0.343363 0.617746 1.509893
C  -0.853657 0.142665 -0.791683
C  -1.162142 1.779048 0.934566
C  -1.300293 -0.472379 2.057109
C  -1.436958 1.518571 -0.431682
C  -1.878732 -0.932592 -0.394264
C  -2.12084 -1.175938 0.993458
C  -1.629681 2.947449 1.556678
C  -2.182373 2.421342 -1.203745
C  -2.639979 -1.619166 -1.36546
C  3.25752 -0.168233 -0.352053
C  -3.1377 -2.084861 1.370233
C  -2.380805 3.867633 0.781243
C  -2.652084 3.607745 -0.583454
C  -3.645966 -2.532162 -0.97779
C  -3.899916 -2.760946 0.395004
C  3.589117 -0.744356 -1.588365
C  3.937364 -0.435985 0.847147
C  4.661469 -1.66708 -1.614416
C  5.005076 -1.362944 0.801359
C  5.360016 -1.977632 -0.423337
H  0.71114 -0.993354 0.361281
H  0.385679 0.922487 2.27618
H  -0.532296 0.050137 -1.840798
H  -1.91764 -0.08963 2.884388
H  -1.399121 3.162811 2.605723
H  -2.383907 2.230878 -2.263239
H  -2.448474 -1.43214 -2.4285
H  -3.315007 -2.278115 2.43447
H  -2.74202 4.795742 1.237709
H  -3.221956 4.337413 -1.169412
H  -4.229625 -3.059791 -1.74008
H  -4.681399 -3.464827 0.700238
H  3.04528 -0.454706 -2.493862
H  3.660163 0.08111 1.771615
H  4.952857 -2.134425 -2.560891
H  5.559072 -1.597865 1.716165
H  6.19046 -2.691535 -0.451534
