program: Gaussian 09
title: 000275800
version: EM64L-G09RevD.01
frameworkgroup: C1[X(C17H16O2)]
method: RPBEPBE
basis: SDD
operation: Freq
keyword: #pfreq=noraman
keyword: PBEPBE/SDD
title: #p freq=noraman PBEPBE/SDD
converged: YES YES NO NO
title: Mulliken charges:
elementType: O O C C C C C C C C C C C C C C C C C H H H H H H H H H H H H H H H H
charge: -0.264947 -0.266153 0.271325 0.153327 0.186397 0.464189 0.472106 -0.194173 -0.814619 -0.393568 -0.318519 -0.455406 -0.466147 -0.262082 -0.272427 -0.252491 -0.243749 -0.510180 -0.511996 0.180725 0.244438 0.221737 0.302482 0.245128 0.242686 0.225689 0.225344 0.230313 0.227221 0.235533 0.196638 0.242530 0.229193 0.233539 0.195918
chargesum: 0.00000
title: Mulliken charges with hydrogens summed into heavy atoms:
elementType: O O C C C C C C C C C C C C C C C C C
charge: -0.264947 -0.266153 0.271325 0.153327 0.186397 0.464189 0.472106 -0.013448 -0.570182 -0.171831 -0.016037 -0.210277 -0.223462 -0.036393 -0.047083 -0.022178 -0.016527 0.164522 0.146653
polarizability: 2.90946284e+02 3.17591435e+01 2.26436277e+02 5.94544361e-03 2.80531503e+00 1.02055635e+02
1716.lowfreq: -6.4820 0.0006 0.0008 0.0009 2.8577 8.5688 34.2367 52.6463 74.4375
frequency: 34.2148 52.6246 74.4249 91.8739 101.2403 112.3239 145.0971 170.2133 189.9837 214.7701 232.5764 238.9345 263.7577 305.1549 327.6190 362.0765 392.7553 404.1654 429.8604 470.8273 502.0715 503.2762 545.9791 563.9575 600.4035 635.7873 637.5635 650.5389 715.7118 742.5796 754.5277 767.3467 811.5603 817.1169 850.3207 866.4603 871.6616 879.9404 905.6980 935.7160 950.8602 961.1103 971.6151 988.6271 991.7541 1002.0857 1023.4391 1026.3727 1029.9778 1074.8093 1105.0128 1108.4013 1116.4699 1144.9210 1159.5003 1164.6751 1172.5140 1188.4522 1199.9771 1251.7888 1280.4898 1291.7466 1306.4885 1328.2324 1350.5804 1377.8482 1396.2137 1416.4472 1423.7318 1434.5609 1437.2800 1446.6329 1449.9510 1453.4745 1457.0453 1474.7639 1478.5196 1492.5814 1539.0140 1567.2961 1585.2761 1630.1841 1633.7602 2926.7651 2934.1146 2950.9351 3019.6330 3060.1673 3107.1517 3115.4680 3119.5354 3121.2714 3122.2891 3132.3400 3134.8472 3152.1858 3156.3651 3165.8429 3200.5213
redmass: 3.7207 3.8371 3.1682 2.3736 3.7929 3.6182 1.3652 1.4965 2.3481 3.5439 3.9240 4.3338 3.6563 3.6968 4.3760 3.8034 6.4863 5.0884 3.4408 2.6852 3.5762 5.6611 5.4558 2.9879 6.5124 6.1186 4.2938 6.0995 4.9405 1.2822 3.2042 1.3522 2.1235 4.5792 2.0163 1.7259 5.3068 2.9760 4.7646 2.1250 5.8112 1.3866 1.4779 1.3613 1.3876 9.0047 3.4984 2.3525 2.8181 3.8527 2.2847 1.2667 1.2751 1.3387 1.5924 1.2917 1.1299 1.1832 1.3028 1.6217 1.9437 1.9270 1.2186 2.0902 3.7637 1.5693 1.9100 4.1943 1.1639 1.1527 8.1836 2.6624 2.0539 1.0822 1.0535 1.0603 1.0571 2.6819 5.8456 7.7433 5.4143 6.4296 6.1034 1.0794 1.0390 1.0387 1.0988 1.0937 1.0985 1.0909 1.0864 1.0864 1.1027 1.0882 1.0909 1.0940 1.0984 1.0993 1.0944
irintensity: 0.7886 0.1471 2.3167 4.4048 4.1842 0.4756 2.1295 3.0791 2.4721 3.8042 3.4418 2.1718 2.2174 2.7852 2.5991 4.2532 1.2469 1.1888 11.2342 0.0719 0.1349 1.1455 1.8425 15.2286 7.4247 3.5459 21.7293 2.9781 14.5332 89.2342 0.4768 1.5943 1.6328 16.9293 6.5061 4.3560 9.2442 98.4676 19.7176 10.2475 20.4281 0.9555 8.7520 2.0982 7.1654 154.3117 17.5947 3.1972 32.3551 125.5355 0.9997 1.8585 2.1317 5.5935 12.9298 22.4983 1.6899 2.6634 4.4707 9.8451 4.2384 0.3100 18.3684 4.2310 6.8325 4.1917 2.7735 0.9495 3.3227 4.4513 2.7925 12.1478 6.8895 14.8852 8.5594 12.1220 13.6317 3.7675 8.3134 1.0092 0.9940 1.3377 1.7951 28.7244 75.2165 89.5316 49.1302 37.0248 28.7815 5.0220 1.4750 5.3579 21.0548 5.5430 23.9296 35.8932 45.8167 37.9164 7.1929
temp: 298.150 k
press: 1.00000 atm
elementType: 8 8 6 6 6 6 6 6 6 6 6 6 6 6 6 6 6 6 6 1 1 1 1 1 1 1 1 1 1 1 1 1 1 1 1
symmnumber: 1
zpe: 738554.2 jmol-1
zpe.correction: 0.281300 hartree
zpe.thermalcorrener: 0.297955 hartree
zpe.thermalcorrenthalpy: 0.298899 hartree
zpe.thermalcorrgfe: 0.236865 hartree
zpe.sumelectzpe: -806.489331 hartree
zpe.sumelectthermal: -806.472677 hartree
zpe.sumelectthermalent: -806.471732 hartree
zpe.sumelectthermalfe: -806.533766 hartree
dipole: -1.2620 -1.2319 1.1633
dipole: 2.1127
quadrupole: -101.5301 -91.9984 -115.0836
quadrupole: -0.1021 -0.5851 0.2770
quadrupole: 1.3406 10.8723 -12.2129 -0.1021 -0.5851 0.2770
hfenergy: -806.7706314 hartree
pointgroup: C01 [X(C17H16O2)]
dipole: -0.5715579 0.3845686 -0.4651093 debye
polarizability: 299.4967576|-19.5926985|217.9475593|-0.8743624|-0.1266566|101.9938797 unknown
InChI: InChI=1S/C17H16O2/c1-18-17(19-2)16-14-9-5-3-7-12(14)11-13-8-4-6-10-15(13)16/h3-11,17H,1-2H3
charge 0 multiplicity 1
35 atoms
O  1.207486 2.288467 1.184306
O  1.302959 2.286354 -1.161716
C  0.042812 0.493148 0.062064
C  -1.343237 0.129087 0.086027
C  1.059442 -0.516881 0.064118
C  -1.709353 -1.288152 0.094182
C  0.674128 -1.925164 0.078023
C  0.444871 1.961491 0.008872
C  -0.69573 -2.27132 0.088717
C  -2.432382 1.082731 0.10871
C  2.471467 -0.20968 0.054354
C  -3.099075 -1.671136 0.111281
C  1.693152 -2.944746 0.080879
C  -3.763193 0.676483 0.127594
C  3.426744 -1.221266 0.056346
C  -4.108406 -0.7178 0.1255
C  3.040063 -2.605474 0.069635
C  1.475394 3.731117 1.316055
C  0.572144 2.23596 -2.429944
H  -0.442021 2.62981 -0.063443
H  -0.980277 -3.331396 0.095676
H  -2.223745 2.155838 0.125727
H  2.777678 0.83672 0.050696
H  -3.342124 -2.740528 0.115839
H  1.380293 -3.995727 0.093875
H  -4.560505 1.427921 0.148866
H  4.491499 -0.962382 0.051329
H  -5.161552 -1.018136 0.140086
H  3.810066 -3.384931 0.072551
H  2.015012 3.845167 2.26826
H  0.525282 4.304474 1.355027
H  2.092156 4.094367 0.475643
H  0.228873 1.208411 -2.66228
H  1.282611 2.568539 -3.202662
H  -0.30743 2.915533 -2.419495
