program: Gaussian 09
title: 000275806
version: EM64L-G09RevD.01
frameworkgroup: C1[X(C18H16O3)]
method: RPBEPBE
basis: SDD
operation: Freq
keyword: #pfreq=noraman
keyword: PBEPBE/SDD
title: #p freq=noraman PBEPBE/SDD
converged: YES YES NO NO
title: Mulliken charges:
elementType: O O O C C C C C C C C C C C C C C C C C C H H H H H H H H H H H H H H H H
charge: -0.441506 -0.264180 -0.239037 0.102036 -0.337492 0.186425 0.225731 -0.684305 -0.209213 0.382656 0.207600 0.175997 -0.410255 -0.429773 -0.451456 -0.403429 -0.216014 -0.223816 -0.238571 -0.240261 -0.497723 0.293204 0.250646 0.232268 0.247009 0.260485 0.243250 0.239784 0.267529 0.343604 0.225650 0.224854 0.227416 0.227629 0.235025 0.242800 0.245433
chargesum: 0.00000
title: Mulliken charges with hydrogens summed into heavy atoms:
elementType: O O O C C C C C C C C C C C C C C C C C C
charge: -0.097902 -0.264180 -0.239037 0.102036 -0.044289 0.186425 0.225731 -0.201391 0.037796 0.382656 0.207600 0.175997 -0.149770 -0.186523 -0.211672 -0.135900 0.009636 0.001038 -0.011155 -0.012632 0.225536
polarizability: 2.01627300e+02 1.25107812e+01 1.76956297e+02 3.48626190e+00 6.72321094e-01 1.87581825e+02
1716.lowfreq: -10.9856 -9.4467 -7.9356 0.0001 0.0004 0.0004 4.8756 40.1816 54.6243
frequency: -10.2405 40.1567 54.5381 78.2078 89.9145 101.4915 110.7881 131.5718 153.7959 201.3551 231.8635 246.8461 269.9677 289.9961 297.6160 329.8569 367.5421 373.9065 402.9251 424.9930 436.2226 485.4069 492.9408 503.9655 541.8919 569.6652 589.0190 614.8770 670.9940 694.7104 709.6072 724.7858 731.8740 754.2554 757.8703 765.1077 774.4350 820.4470 832.6124 874.8512 882.7482 887.3214 908.4120 944.7313 950.8264 960.1002 987.1217 991.5012 993.4141 999.9466 1003.3910 1027.3716 1040.6341 1071.7016 1104.6454 1107.9847 1112.7588 1142.3727 1146.2267 1149.7726 1162.5240 1172.2071 1192.6974 1193.9141 1209.6464 1211.5953 1222.8894 1233.6914 1240.4032 1268.4700 1280.0968 1319.8413 1325.9015 1358.6324 1382.7047 1406.4790 1419.2235 1441.2864 1443.4455 1447.5730 1451.0817 1456.9974 1462.8555 1479.2408 1589.6526 1602.3313 1615.3506 1622.1504 1626.0542 2957.9285 3006.7633 3008.4884 3052.6098 3074.8626 3110.4565 3118.2949 3121.6028 3130.7894 3133.3578 3146.4175 3149.2197 3151.8798 3162.0949 3163.3922 3527.3312
redmass: 5.2100 5.3648 4.5632 3.0422 1.2726 4.0079 4.4353 4.0232 4.6980 4.6392 3.5056 5.0122 4.1857 4.9870 3.5451 3.5870 3.5438 1.6868 2.7313 4.1837 3.7612 3.6702 4.2112 4.4231 4.8395 5.2092 4.7554 4.8159 3.7551 6.0253 4.3583 3.8259 3.2378 2.4154 4.2207 1.7634 1.6592 4.3692 3.9183 1.4998 1.3871 2.7942 4.0942 1.4849 2.8470 1.7817 1.3253 2.8512 1.3212 4.5515 2.4165 2.8971 2.8401 2.9589 2.3047 1.7211 1.3049 1.7101 2.0658 1.4138 1.2544 1.0621 2.1802 1.7761 1.8985 1.3678 1.8219 1.5047 3.3043 1.4920 1.4888 1.5836 1.5615 1.2331 6.6946 4.9365 1.1881 2.2488 2.3194 2.6594 1.0511 1.2088 1.0511 2.5099 7.0049 7.4748 6.7417 8.1337 9.7555 1.0668 1.0292 1.0836 1.0934 1.0861 1.1047 1.0868 1.0861 1.0885 1.0905 1.0934 1.0952 1.1051 1.1003 1.0993 1.0655
irintensity: 2.6190 0.4595 0.8315 0.5571 0.0419 0.7690 1.0271 0.0733 0.3609 6.6943 4.7089 4.8461 5.8676 6.9755 0.0315 23.5681 20.7460 120.6618 7.2190 0.9719 10.3283 1.1839 2.3811 35.4722 0.4192 7.6610 2.5523 5.8583 13.7613 9.9684 20.0472 7.8514 15.4034 13.7571 7.6301 30.2158 51.4460 6.3444 0.8921 1.1692 1.4014 9.1213 2.3897 3.6662 22.3991 19.7127 0.5813 33.1335 0.3275 57.4459 12.1608 29.5719 8.8768 16.0363 14.8874 2.1875 0.6297 76.5768 70.9686 33.6217 5.3257 1.2977 106.0252 15.3274 3.0126 3.3808 32.9612 14.4840 8.3352 0.4919 9.4397 2.1922 1.0813 42.2399 1.8392 3.9580 19.4807 3.9739 4.3321 16.1059 15.9643 17.2387 12.2039 17.3253 4.9257 6.9617 2.9352 16.4336 123.9283 24.9113 35.8407 16.6795 8.2090 7.7773 22.6540 3.8189 0.9286 9.4585 12.6691 15.6811 24.6450 13.3676 32.0265 21.2002 3.4415
temp: 298.150 k
press: 1.00000 atm
elementType: 8 8 8 6 6 6 6 6 6 6 6 6 6 6 6 6 6 6 6 6 6 1 1 1 1 1 1 1 1 1 1 1 1 1 1 1 1
symmnumber: 1
zpe: 764475.2 jmol-1
zpe.correction: 0.291173 hartree
zpe.thermalcorrener: 0.308270 hartree
zpe.thermalcorrenthalpy: 0.309214 hartree
zpe.thermalcorrgfe: 0.246448 hartree
zpe.sumelectzpe: -919.673798 hartree
zpe.sumelectthermal: -919.656701 hartree
zpe.sumelectthermalent: -919.655757 hartree
zpe.sumelectthermalfe: -919.718523 hartree
dipole: -0.4465 0.3127 -0.2418
dipole: 0.5963
quadrupole: -111.8958 -112.3700 -124.9276
quadrupole: 7.6247 -8.3330 1.8328
quadrupole: 4.5020 4.0278 -8.5298 7.6247 -8.3330 1.8328
hfenergy: -919.9649711 hartree
pointgroup: C01 [X(C18H16O3)]
dipole: 0.1883265 0.1068254 0.0902962 debye
polarizability: 198.4876682|-14.7818922|180.0002378|4.1214129|-0.7144196|187.6775163 unknown
InChI: InChI=1S/C18H16O3/c1-21-17(20)18-10-11-6-2-3-7-12(11)16(19)15(18)13-8-4-5-9-14(13)18/h2-9,15-16,19H,10H2,1H3
charge 0 multiplicity 1
37 atoms
O  -1.26077 -0.251597 -2.909861
O  2.911505 -1.824648 -0.667207
O  3.014742 -1.201265 1.572311
C  1.017612 -0.616592 0.263535
C  0.567517 -0.304847 -1.247425
C  0.980997 0.913353 0.485671
C  0.584648 1.181696 -0.84371
C  -0.010674 -1.455154 1.080495
C  -0.807374 -0.888819 -1.661909
C  -1.445428 -1.046957 0.796689
C  -1.846462 -0.791795 -0.544629
C  2.401283 -1.214865 0.480059
C  1.205136 1.917861 1.434813
C  0.384589 2.490823 -1.308938
C  -2.400933 -0.956258 1.834956
C  -3.195291 -0.473762 -0.824764
C  0.991118 3.249574 0.978778
C  0.592163 3.527584 -0.355331
C  -3.746742 -0.63091 1.553047
C  -4.145439 -0.393298 0.218119
C  4.249694 -2.451964 -0.514952
H  1.31915 -0.589399 -2.000032
H  0.224196 -1.363663 2.155808
H  0.128941 -2.523839 0.811235
H  -0.667411 -1.947019 -1.95431
H  1.533571 1.711047 2.458168
H  0.110656 2.729889 -2.34297
H  -2.088394 -1.14083 2.869937
H  -3.495338 -0.305537 -1.864396
H  -1.424185 0.708698 -2.716141
H  1.145601 4.086779 1.669305
H  0.451769 4.571922 -0.657852
H  -4.476965 -0.563672 2.367145
H  -5.188949 -0.148357 -0.00953
H  4.465552 -2.892179 -1.498221
H  4.220904 -3.223045 0.272852
H  4.996808 -1.686859 -0.246244
