program: Gaussian 09
title: 000270261
version: EM64L-G09RevD.01
frameworkgroup: C1[X(C10H14N2O6S)]
method: RPBEPBE
basis: SDD
operation: Freq
keyword: #p
keyword: freq=noraman
keyword: PBEPBE/SDD
title: #p freq=noraman PBEPBE/SDD
converged: NO YES NO NO
title: Mulliken charges:
elementType: S O O O O O O N N C C C C C C C C C C H H H H H H H H H H H H H H
charge: 0.263462 -0.281418 -0.424071 -0.438039 -0.438946 -0.246386 -0.311161 -0.237276 -0.396666 -0.154907 -0.174090 -0.093251 -0.057937 -0.356335 0.210628 0.302126 -0.257597 -0.088992 -0.840510 0.287804 0.246787 0.289236 0.265859 0.177719 0.229539 0.335746 0.363122 0.362068 0.267757 0.354247 0.283890 0.282930 0.274659
chargesum: 0.00000
title: Mulliken charges with hydrogens summed into heavy atoms:
elementType: S O O O O O O N N C C C C C C C C C C
charge: 0.263462 -0.281418 -0.088325 -0.074917 -0.084699 -0.246386 -0.311161 -0.237276 -0.034598 0.132897 0.072697 0.195985 0.207922 0.050924 0.210628 0.302126 0.010161 -0.088992 0.000968
polarizability: 2.29607913e+02 3.00999552e+00 1.57846405e+02 -9.62777680e+00 4.86495272e+00 1.05175580e+02
1716.lowfreq: -12.4647 -6.4027 -0.0015 0.0006 0.0019 4.6686 23.9519 33.3842 52.8972
frequency: 23.6602 33.2557 52.8930 54.2789 96.7365 98.2686 114.9756 141.1079 152.5036 163.2084 183.6740 203.2712 208.6745 219.4731 247.9155 281.6409 294.9444 307.6082 334.3322 368.1754 409.9025 413.5465 446.4177 464.6166 496.4203 528.2246 543.1435 568.7116 581.7755 597.2691 608.4578 617.0107 657.5483 664.4022 699.8557 718.5585 739.1758 783.9779 793.8407 805.6378 903.7708 917.3595 941.9569 961.5411 976.7626 978.1453 997.5745 1002.9998 1012.0165 1038.4623 1050.2270 1073.6201 1089.3533 1100.4581 1122.0555 1171.2256 1175.4581 1188.8682 1205.6789 1221.5540 1268.8545 1283.7668 1290.6657 1308.7755 1319.4099 1335.1787 1351.3896 1354.1947 1362.2277 1379.4003 1405.0922 1419.6708 1452.2662 1454.9144 1456.0724 1461.7001 1565.8231 1611.8577 1660.3469 2939.5771 3020.3026 3027.9522 3039.3309 3079.3325 3086.6475 3110.9248 3147.0107 3149.6087 3223.8330 3432.3790 3533.4450 3541.9515 3546.4731
redmass: 6.3574 4.5877 6.3700 7.3217 5.9192 4.8796 5.3724 3.5982 5.9005 2.7780 5.7108 4.2149 1.4990 5.6228 6.0073 4.2117 4.9178 1.9225 2.1167 11.4853 4.4681 6.2170 1.2620 3.3429 7.0084 7.8442 4.6844 8.8748 8.4381 5.8479 1.5623 3.8880 1.0885 7.3953 2.2255 5.7557 6.0599 5.4021 2.8018 1.7590 3.7738 9.5216 4.4382 3.3376 1.1766 5.8296 1.6511 2.5476 2.9966 3.4387 3.2592 4.8427 3.9527 2.0079 2.3390 1.1973 3.9909 1.3805 1.4044 1.3568 1.3580 1.3375 1.6402 1.4153 1.3455 1.3427 1.2937 2.0629 1.2372 1.2996 1.1975 1.2800 1.0514 1.1261 1.4100 1.4237 7.0373 8.2135 6.1900 1.0694 1.0285 1.0855 1.0853 1.0940 1.0864 1.0878 1.1071 1.1033 1.0928 1.0646 1.0779 1.0663 1.0656
irintensity: 1.2579 2.2551 0.1553 0.7001 4.5238 1.5764 1.6340 2.5273 5.0017 0.4899 6.6726 0.4000 0.4575 4.4960 18.9220 5.3314 7.2531 53.7602 69.3490 1.4502 6.6972 4.6635 190.2086 25.3259 2.7352 10.6115 22.1159 11.4734 5.7280 13.6255 31.3656 20.1116 127.3869 2.2992 21.9240 42.9031 19.8165 11.3730 20.6411 55.4470 26.6158 200.7060 143.8884 61.1773 8.6982 58.8109 13.5389 52.9811 48.8072 51.5780 14.1177 19.8122 32.1972 18.5165 3.3348 14.8314 19.9883 82.3581 44.9454 10.5056 23.4633 6.6261 52.2240 2.7591 8.4813 41.1333 56.5989 225.5418 8.3621 38.3742 128.1995 14.6684 19.0331 33.0113 104.8272 12.6643 91.2901 710.8003 474.7115 64.5727 9.6082 16.2673 32.7812 20.7836 8.2126 9.2271 8.1874 2.4968 1.7304 222.0660 89.0748 8.9040 9.2417
temp: 298.150 k
press: 1.00000 atm
elementType: 16 8 8 8 8 8 8 7 7 6 6 6 6 6 6 6 6 6 6 1 1 1 1 1 1 1 1 1 1 1 1 1 1
symmnumber: 1
zpe: 648786.0 jmol-1
zpe.correction: 0.247110 hartree
zpe.thermalcorrener: 0.266325 hartree
zpe.thermalcorrenthalpy: 0.267269 hartree
zpe.thermalcorrgfe: 0.198396 hartree
zpe.sumelectzpe: -1346.908452 hartree
zpe.sumelectthermal: -1346.889236 hartree
zpe.sumelectthermalent: -1346.888292 hartree
zpe.sumelectthermalfe: -1346.957165 hartree
dipole: -7.8548 -0.5205 0.2790
dipole: 7.8769
quadrupole: -95.5578 -126.4188 -136.4370
quadrupole: 17.6675 -3.7806 0.2375
quadrupole: 23.9134 -6.9476 -16.9658 17.6675 -3.7806 0.2375
hfenergy: -1347.1555613 hartree
pointgroup: C01 [X(C10H14N2O6S1)]
dipole: 3.077689 0.2254329 -0.2845719 debye
polarizability: 229.0361692|12.1980613|107.1046632|-2.8055265|-10.4138629|156.4890649 unknown
InChI: InChI=1S/C10H14N2O6S/c1-19-5-2-6(14)12(10(17)11-5)9-8(16)7(15)4(3-13)18-9/h2,4,7-9,11,13,15-16H,3H2,1H3
charge 0 multiplicity 1
33 atoms
S  4.919306 0.261673 0.01994
O  -1.775911 0.467665 0.994356
O  -2.512206 -2.752832 0.857964
O  -2.58958 -0.935309 -2.234432
O  -3.643976 2.588988 0.780852
O  0.99104 -0.83827 2.898493
O  -0.030939 -0.208155 -1.665446
N  0.422621 -0.55789 0.613035
N  2.67115 -0.322802 1.386253
C  -1.812096 -1.752478 0.040931
C  -2.790235 -0.855889 -0.800803
C  -1.020957 -0.781139 0.962651
C  -2.612184 0.58804 -0.247526
C  -3.905739 1.276713 0.187565
C  1.323829 -0.592607 1.710918
C  0.82525 -0.247953 -0.725476
C  2.238927 -0.000719 -0.942923
C  3.1325 -0.03487 0.10571
C  5.15035 0.618641 -1.809428
H  -1.169331 -2.351358 -0.618956
H  -3.820235 -1.226505 -0.645572
H  -0.986625 -1.165627 1.993869
H  -2.066005 1.213671 -0.976435
H  -4.454955 0.620187 0.898881
H  -4.544613 1.46653 -0.691408
H  -3.200105 -2.301786 1.412645
H  -1.641858 -0.662618 -2.392077
H  3.305129 -0.351981 2.189482
H  2.535604 0.220162 -1.966666
H  -2.967757 2.458965 1.495417
H  4.574442 1.510312 -2.097385
H  4.860416 -0.258436 -2.406375
H  6.226647 0.813176 -1.927452
