program: Gaussian 09
title: 000275804
version: EM64L-G09RevD.01
frameworkgroup: C1[X(C18H16O2)]
method: RPBEPBE
basis: SDD
operation: Freq
keyword: #pfreq=noraman
keyword: PBEPBE/SDD
title: #p freq=noraman PBEPBE/SDD
converged: YES YES NO NO
title: Mulliken charges:
elementType: O O C C C C C C C C C C C C C C C C C C H H H H H H H H H H H H H H H H
charge: -0.273553 -0.225257 -0.614367 -0.570367 -0.196880 -0.491728 0.382758 0.413582 0.410460 0.406215 0.206315 -0.471603 -0.483818 -0.466047 -0.480248 -0.235973 -0.237792 -0.233916 -0.234791 -0.503288 0.280884 0.248281 0.275840 0.234309 0.277641 0.242502 0.244740 0.241098 0.241779 0.223543 0.224501 0.223737 0.224495 0.241311 0.230864 0.244777
chargesum: 0.00000
title: Mulliken charges with hydrogens summed into heavy atoms:
elementType: O O C C C C C C C C C C C C C C C C C C
charge: -0.273553 -0.225257 -0.333483 -0.322087 0.078960 0.020222 0.382758 0.413582 0.410460 0.406215 0.206315 -0.229102 -0.239078 -0.224949 -0.238469 -0.012430 -0.013291 -0.010178 -0.010297 0.213663
polarizability: 2.14062792e+02 -2.11727549e+01 1.80239514e+02 1.57556872e+01 1.91109496e+01 1.64170750e+02
1716.lowfreq: -12.1957 -4.3003 -0.0006 -0.0004 -0.0002 7.7224 24.0099 47.4787 65.2452
frequency: 23.9387 47.4328 65.2439 94.7655 100.8549 137.1604 140.6916 155.9992 186.8396 244.0606 271.0404 309.9982 337.7090 347.7971 368.2306 403.8868 422.1358 450.9877 500.6754 502.7093 530.2233 573.1754 589.1629 604.2633 624.6739 645.6800 706.7704 725.8733 752.9371 757.4925 762.3099 769.5572 788.6145 813.2411 822.9942 847.1241 860.2647 876.7020 889.7612 901.6659 943.2825 944.0900 954.9028 966.7681 984.2516 984.6228 1008.4100 1022.4207 1024.2639 1054.7637 1090.4531 1113.5002 1114.0020 1137.2517 1143.3396 1149.6601 1165.6320 1170.8512 1171.5852 1172.9460 1190.3760 1198.7268 1206.9318 1214.7695 1220.9541 1252.1307 1281.6488 1298.8422 1308.2164 1329.3562 1340.5794 1393.5081 1395.4430 1422.4916 1444.2630 1451.2198 1452.2283 1463.9211 1464.8862 1471.7277 1483.7957 1593.1645 1599.2655 1613.1580 1621.5646 1641.6269 3003.6898 3012.0127 3022.3462 3052.1761 3079.5052 3081.7134 3105.6699 3117.7206 3118.1183 3123.8002 3124.3211 3138.3093 3138.7143 3146.9783 3158.8416 3159.2790
redmass: 5.3413 5.6079 4.8539 2.9263 1.2149 3.9162 3.9512 3.9924 3.9509 4.2992 4.0886 4.3872 3.5212 4.1272 4.3181 4.4830 4.4657 3.3590 4.8010 4.9681 4.3511 4.0206 3.9307 5.3206 4.4670 6.4320 5.7432 4.8842 1.6677 3.7788 1.5761 2.3317 3.6640 3.5888 2.7063 2.8183 3.5040 1.3857 2.0735 4.0687 1.4366 1.5436 3.1345 3.7482 1.3183 1.3201 2.3614 2.4414 2.2212 4.7443 2.0854 1.5338 1.4720 2.9146 1.2189 1.4339 1.7591 1.0912 1.0871 2.6462 1.2289 1.4838 1.4293 1.8864 1.6097 1.8434 1.6309 1.4584 1.5065 1.4130 1.5667 7.1457 6.0459 1.1782 2.3815 2.4724 1.0512 2.3059 1.0597 1.2617 2.0991 6.1748 7.1570 6.9676 7.1548 9.8674 1.0295 1.0688 1.0749 1.0873 1.0893 1.1034 1.1045 1.0857 1.0855 1.0895 1.0896 1.0939 1.0941 1.1049 1.1003 1.1003
irintensity: 0.8079 0.4849 0.4609 1.2264 0.0296 0.9181 0.9143 0.1771 7.0108 4.0704 1.6397 5.3395 12.5452 1.6872 0.0303 1.9530 0.4762 2.4929 0.4989 0.9912 27.0162 1.5015 16.3288 3.0263 13.0686 0.2283 2.4095 5.5691 16.6892 4.4478 68.6926 45.1974 9.6912 1.2187 2.2857 4.2761 2.8219 0.4904 0.2905 0.9063 0.2483 1.6046 12.9504 5.2511 0.0127 0.0678 16.5237 4.0248 7.4353 17.6257 2.5207 35.5769 20.1987 241.4454 14.7678 0.8233 0.7007 0.3395 0.4600 16.6876 1.5796 1.7444 2.6664 3.7820 4.4074 17.3807 11.4618 1.0714 23.7432 0.2376 2.9455 0.0698 0.6642 18.5738 11.7065 0.1238 13.1856 36.8482 9.1877 5.9097 15.4538 1.6681 0.0908 0.2630 0.2585 145.8403 38.7477 11.1331 22.6259 33.6550 7.0873 14.6072 25.2086 1.7668 6.7187 2.9360 2.3295 7.5807 53.8481 15.6168 60.8279 16.2483
temp: 298.150 k
press: 1.00000 atm
elementType: 8 8 6 6 6 6 6 6 6 6 6 6 6 6 6 6 6 6 6 6 1 1 1 1 1 1 1 1 1 1 1 1 1 1 1 1
symmnumber: 1
zpe: 760882.6 jmol-1
zpe.correction: 0.289805 hartree
zpe.thermalcorrener: 0.305845 hartree
zpe.thermalcorrenthalpy: 0.306789 hartree
zpe.thermalcorrgfe: 0.245500 hartree
zpe.sumelectzpe: -844.576477 hartree
zpe.sumelectthermal: -844.560437 hartree
zpe.sumelectthermalent: -844.559493 hartree
zpe.sumelectthermalfe: -844.620782 hartree
dipole: 0.0283 -0.9701 -1.0248
dipole: 1.4114
quadrupole: -108.2974 -109.6236 -112.2676
quadrupole: 2.3931 11.5832 4.8949
quadrupole: 1.7655 0.4392 -2.2047 2.3931 11.5832 4.8949
hfenergy: -844.866282 hartree
pointgroup: C01 [X(C18H16O2)]
dipole: -0.0423994 0.3652941 -0.4160617 debye
polarizability: 216.0174547|-19.8169584|176.2769913|-14.775118|-20.1274313|166.1786103 unknown
InChI: InChI=1S/C18H16O2/c1-20-18(19)16-10-15-11-6-2-4-8-13(11)17(16)14-9-5-3-7-12(14)15/h2-9,15-17H,10H2,1H3
charge 0 multiplicity 1
36 atoms
O  2.53256 2.199611 -0.610483
O  2.965753 1.082063 1.381886
C  0.057648 0.649311 -0.693176
C  -0.780559 -0.573258 1.470399
C  0.619248 1.391796 0.598419
C  0.131894 0.6455 1.879888
C  0.527552 -0.799561 -0.602079
C  -1.460778 0.663539 -0.544469
C  0.069057 -1.465178 0.568229
C  -1.918214 -0.003805 0.625076
C  2.141284 1.50879 0.543666
C  1.338772 -1.473378 -1.53418
C  -2.378248 1.262538 -1.427805
C  0.423621 -2.80639 0.80451
C  -3.294858 -0.072939 0.908589
C  1.690799 -2.826112 -1.299581
C  -3.765593 1.190268 -1.144776
C  1.235399 -3.488782 -0.136086
C  -4.221249 0.525679 0.017378
C  3.994418 2.38272 -0.780269
H  0.406887 1.158961 -1.604537
H  -1.143246 -1.103415 2.367372
H  0.220574 2.423114 0.568107
H  -0.443881 1.329411 2.527359
H  1.003716 0.280833 2.449698
H  1.691208 -0.957234 -2.43506
H  -2.023716 1.77722 -2.328717
H  0.073604 -3.320533 1.707439
H  -3.649335 -0.588341 1.809175
H  2.316347 -3.361742 -2.022551
H  -4.487867 1.648029 -1.830068
H  1.510965 -4.535076 0.038065
H  -5.295341 0.470812 0.228003
H  4.403593 2.97732 0.053881
H  4.102375 2.914229 -1.736192
H  4.500714 1.403302 -0.806912
