program: Gaussian 09
title: 000275792
version: EM64L-G09RevD.01
frameworkgroup: C1[X(C7H13NO4)]
method: RPBEPBE
basis: SDD
operation: Freq
keyword: #p
keyword: freq=noraman
keyword: PBEPBE/SDD
title: #p freq=noraman PBEPBE/SDD
converged: YES YES NO NO
title: Mulliken charges:
elementType: O O O O N C C C C C C C H H H H H H H H H H H H H
charge: -0.424413 -0.223377 -0.417265 -0.228708 -0.587372 0.207100 -0.370301 -0.396474 -0.725773 -0.487454 0.096476 0.170537 0.217073 0.207100 0.219297 0.232209 0.236543 0.215457 0.240630 0.254923 0.255811 0.275378 0.276782 0.379079 0.376743
chargesum: 0.00000
title: Mulliken charges with hydrogens summed into heavy atoms:
elementType: O O O O N C C C C C C C
charge: -0.045335 -0.223377 -0.040522 -0.228708 -0.035212 0.207100 0.053871 0.055033 -0.033143 0.023280 0.096476 0.170537
polarizability: 1.06495759e+02 7.61666303e-01 8.77669161e+01 -2.79031316e+00 5.63111541e+00 8.82797464e+01
1716.lowfreq: -15.9156 -7.1159 -0.0007 0.0004 0.0005 3.8620 11.9058 29.5719 41.9606
frequency: 11.6047 29.4374 41.9383 72.2178 83.1796 102.9029 179.2815 207.0801 223.3903 241.5218 250.8754 287.1275 352.4570 358.0029 410.6177 482.0891 494.8475 502.0752 556.5694 591.8716 602.0911 640.4719 686.2203 707.0239 727.6373 745.1998 832.6794 861.6979 901.6449 954.5060 1006.2022 1020.4693 1023.4635 1049.7765 1074.8983 1083.8303 1122.9912 1172.5819 1219.1831 1240.9560 1261.9251 1284.0408 1285.7944 1294.8526 1308.3050 1349.1512 1373.8914 1384.4382 1436.2447 1446.8543 1468.9014 1473.5115 1478.1925 1643.4315 1656.3453 1669.6964 2987.0873 2988.3522 2991.9697 3000.3479 3031.3325 3049.8425 3073.0625 3084.0078 3115.1432 3442.9026 3499.4705 3511.7687 3558.4612
redmass: 10.7970 9.9995 5.2435 2.0123 3.7355 3.0319 2.0677 2.4785 1.6216 1.7661 1.9792 2.4787 3.6004 3.6218 3.1068 3.2959 3.1130 1.9007 3.6596 4.3928 1.2859 1.3137 3.2707 1.5340 4.4896 1.2933 2.1997 2.3526 2.3663 2.0201 1.5500 2.9011 3.1877 1.7503 2.4329 2.6301 1.4962 1.7874 1.8249 1.6397 1.5830 1.6306 1.4673 1.8403 1.2329 1.6482 1.6530 1.2804 1.0873 1.0760 1.0599 1.0926 1.0518 4.0551 1.2910 8.1291 1.0592 1.0389 1.0598 1.0588 1.0975 1.1015 1.1039 1.0979 1.1007 1.0458 1.0641 1.0639 1.0954
irintensity: 0.7951 3.3872 0.0344 0.3282 1.2656 0.5746 29.1939 4.0786 26.1696 6.8326 2.9413 8.9376 24.6003 7.4684 6.0221 36.1639 26.2334 31.6472 2.7667 13.4720 115.8348 124.3032 30.6775 145.1832 25.5888 75.0378 2.6081 1.4984 1.5746 8.5366 32.6277 193.8773 222.5070 5.7719 6.9958 68.6516 4.5320 18.5568 9.3326 1.4062 5.1143 5.5259 3.8456 46.7133 2.1961 16.0667 34.2124 5.3615 20.5091 8.2105 8.8545 13.8432 11.7449 90.7672 136.4852 244.5264 8.6995 16.4736 3.6312 45.8036 0.2876 0.9009 47.3920 26.9513 16.4884 0.8066 11.2540 19.8609 0.7522
temp: 298.150 k
press: 1.00000 atm
elementType: 8 8 8 8 7 6 6 6 6 6 6 6 1 1 1 1 1 1 1 1 1 1 1 1 1
symmnumber: 1
zpe: 528162.9 jmol-1
zpe.correction: 0.201167 hartree
zpe.thermalcorrener: 0.215404 hartree
zpe.thermalcorrenthalpy: 0.216349 hartree
zpe.thermalcorrgfe: 0.157368 hartree
zpe.sumelectzpe: -629.245452 hartree
zpe.sumelectthermal: -629.231214 hartree
zpe.sumelectthermalent: -629.230270 hartree
zpe.sumelectthermalfe: -629.289250 hartree
dipole: -0.0927 -1.1176 -2.1773
dipole: 2.4491
quadrupole: -64.1247 -75.4570 -73.2255
quadrupole: 0.4993 0.6774 -5.9283
quadrupole: 6.8110 -4.5213 -2.2898 0.4993 0.6774 -5.9283
hfenergy: -629.4466185 hartree
pointgroup: C01 [X(C7H13N1O4)]
dipole: -0.0335517 0.5062316 0.8191871 debye
dipolederiv: -0.4172941 0.0243995 -0.0302165 0.032106 -0.2936439 0.1945592 -0.0467298 0.0757397 -1.1833942 -0.3366033 -0.1573287 -0.1165097 -0.2161796 -0.8328607 -0.278667 -0.0555994 -0.0419541 -0.6860859 -1.1679193 -0.3169109 -0.3677331 -0.2488793 -0.4195604 -0.026622 -0.330586 -0.0365905 -0.5068564 -0.6838683 0.1017123 0.0449532 -0.0789519 -0.6706751 -0.33667 -0.126161 -0.3071996 -0.5857444 -0.3175286 -0.0759097 0.0315411 -0.0596549 -0.5490812 0.1746496 -0.0121127 0.1745198 -0.6772939 0.1746437 0.0308628 0.0104431 0.0265036 0.1008957 -0.0151111 0.0281538 -0.1826621 0.5623564 0.0399193 0.0440391 -0.0459321 -0.007435 0.0741574 -0.0204175 0.0054094 0.0241026 0.068522 0.0026132 0.0077897 -0.0059888 -0.0057424 0.07752 -0.0625952 -0.0203484 -0.0686981 0.1056122 -0.0097772 -0.0076778 0.0766522 0.0283759 -0.0086238 -0.0154033 0.0076743 0.0453947 -0.0065654 -0.1816005 0.1008824 0.0439374 0.2656905 -0.03611 -0.1280394 0.1577218 -0.1395859 0.0530906 0.1884095 0.2280412 0.1687251 0.3054413 1.0129178 0.1290079 0.1136023 -0.0026577 1.2791296 1.5569081 0.0410706 0.220932 0.0672505 0.8078713 0.5549212 0.2741509 0.5441018 0.6969674 0.0301403 -0.0427991 0.0124214 -0.0212682 -0.1412337 0.0460686 0.0180214 0.0601405 0.0719321 0.0451552 0.0110853 -0.0090794 0.0202619 0.0828862 -0.0008565 -0.0047087 -0.0254001 -0.1310497 0.0701732 -0.0001882 -0.0061729 -0.0221954 0.0658815 -0.0093328 0.0024453 -0.0068328 -0.1322763 0.0481522 -0.0297148 0.0065526 -0.0418663 -0.121155 0.0442352 -0.0092811 0.0524092 0.0489536 0.0937616 0.0006009 -0.0254295 0.0114905 0.1057123 0.0114185 0.0179991 -0.0189833 -0.1089536 -0.1498337 -0.0249079 -0.0483386 -0.070938 0.0621674 -0.0467524 -0.0917079 -0.0298178 0.0614033 0.0878801 -0.0368961 0.0192174 -0.007586 -0.1169411 0.0533882 0.0175573 0.0621202 0.0846043 0.0573249 0.0169631 0.0100163 -0.0144264 0.1093354 0.0149205 -0.0371525 -0.0022639 -0.0816727 0.0551077 -0.0069964 0.012884 -0.059651 -0.063835 0.0316446 -0.000395 0.0558359 0.0972814 0.0143361 -0.0366565 -0.0576603 -0.1197429 0.2841241 -0.1259002 0.0035344 -0.0439287 0.1917694 0.1946988 0.1101732 0.0090422 0.1694116 0.1538131 -0.1321152 0.0316521 -0.0486286 0.183662 0.3637286 -0.0636247 -0.0047448 -0.0742168 0.0737136 0.0545246 -0.0277626 -0.0229895 0.2955741 0.2414724 0.0819906 0.0504876 0.1222025 0.2427244 -0.1108554 0.0846228 -0.1161714 0.2990338 unknown
polarizability: 106.5809665|-0.1620559|88.6568329|2.4836964|5.6488616|87.3046224 unknown
InChI: InChI=1S/C7H13NO4/c1-7(8,6(11)12)4-2-3-5(9)10/h9,11H,2-4,8H2,1H3
charge 0 multiplicity 1
25 atoms
O  -2.008023 -1.009645 1.703704
O  -2.453494 -1.902716 -0.387805
O  4.434471 0.410153 0.504195
O  3.280419 -1.019887 -0.914498
N  -1.908302 0.583988 -1.683026
C  -1.864814 0.527644 -0.213181
C  -0.472679 1.009889 0.296131
C  0.722566 0.163502 -0.191489
C  -2.97311 1.456719 0.35056
C  2.047322 0.695963 0.386862
C  -2.138602 -0.912839 0.307914
C  3.259712 -0.075675 -0.095678
H  -0.357931 2.052505 -0.057366
H  -0.493145 1.021961 1.401923
H  0.786718 0.177934 -1.295451
H  0.5970 -0.8955 0.105344
H  -2.966235 1.455212 1.452615
H  -3.975018 1.136422 0.008126
H  -2.793805 2.481184 -0.018005
H  2.041626 0.667256 1.493849
H  2.196862 1.760591 0.117821
H  -2.850826 0.42547 -2.058135
H  -1.238889 -0.049665 -2.134877
H  -2.207349 -1.943579 1.98732
H  5.213023 -0.108991 0.163345
