program: Gaussian 09
title: 000275813
version: EM64L-G09RevD.01
frameworkgroup: C1[X(C20H18O4)]
method: RPBEPBE
basis: SDD
operation: Freq
keyword: #pfreq=noraman
keyword: PBEPBE/SDD
title: #p freq=noraman PBEPBE/SDD
converged: YES YES NO NO
title: Mulliken charges:
elementType: O O O O C C C C C C C C C C C C C C C C C C C C H H H H H H H H H H H H H H H H H H
charge: -0.265461 -0.266223 -0.230389 -0.255180 -0.426688 -0.263850 -0.558755 -0.269333 0.363916 0.352121 0.372540 0.347124 0.186228 -0.468136 -0.452830 -0.449120 -0.396811 -0.230563 -0.226695 -0.234100 -0.260509 0.310560 -0.498698 -0.760123 0.298324 0.297660 0.306053 0.297009 0.249888 0.244111 0.239049 0.273880 0.225720 0.225797 0.228031 0.230414 0.245869 0.232277 0.241498 0.248648 0.245471 0.251273
chargesum: 0.00000
title: Mulliken charges with hydrogens summed into heavy atoms:
elementType: O O O O C C C C C C C C C C C C C C C C C C C C
charge: -0.265461 -0.266223 -0.230389 -0.255180 -0.128364 0.033810 -0.252702 0.027676 0.363916 0.352121 0.372540 0.347124 0.186228 -0.218248 -0.208719 -0.210070 -0.122931 -0.004843 -0.000897 -0.006069 -0.030094 0.310560 0.220946 -0.014732
polarizability: 2.32641807e+02 -8.36849863e+00 2.22271871e+02 7.37563927e+00 1.98300690e+01 1.94091236e+02
1716.lowfreq: -10.1858 -4.5368 0.0009 0.0010 0.0010 7.1316 20.9729 34.0864 39.8906
frequency: 20.9226 34.0387 39.8278 48.4451 56.9588 63.1498 71.0800 92.2875 105.9517 114.4461 142.1330 156.2245 199.1935 208.9730 232.6954 234.4702 275.8908 298.6109 314.0498 342.3108 357.5042 412.7140 433.3265 454.0609 481.8465 507.9023 524.6251 551.1514 559.0397 566.9028 603.7002 610.1033 619.5430 623.7263 647.1726 726.6855 731.3146 739.8852 748.6355 763.7919 770.2007 789.1077 820.3450 841.5763 862.0465 877.2054 892.0681 894.8733 900.0939 907.8828 947.5217 950.1336 963.9995 981.8942 987.6660 992.2217 994.6227 1017.4229 1019.2931 1030.2541 1041.9249 1048.0608 1081.5829 1106.1130 1113.6493 1142.3801 1148.4914 1160.4337 1168.0805 1169.9212 1175.2664 1186.9584 1194.3934 1198.2079 1210.1077 1222.2905 1235.0266 1251.8407 1263.9162 1288.0981 1297.5558 1305.3272 1336.5425 1342.7690 1381.0434 1383.0052 1396.4949 1421.7933 1443.9280 1448.3763 1452.0455 1452.9481 1454.8915 1463.2413 1465.9622 1482.4786 1586.6595 1600.6325 1612.5385 1618.9146 1634.0673 1641.0346 3005.8940 3006.2077 3022.9765 3036.3386 3073.2643 3086.7838 3098.1080 3108.8243 3120.7831 3122.8624 3130.5768 3131.1712 3141.5884 3143.1015 3143.5478 3150.0848 3161.5896 3162.2708
redmass: 5.2892 6.0694 1.2295 7.1199 4.7874 3.9092 2.5204 1.1481 4.1163 3.9808 4.0344 4.1288 6.9505 5.3561 6.8838 5.5094 4.2054 5.3914 4.4959 4.9378 4.5733 3.3284 3.9010 4.0077 4.6399 4.1409 5.5009 4.1979 3.2425 4.7659 4.6521 5.4298 6.1553 4.9729 5.2924 4.9839 4.2414 3.9721 3.5468 1.4809 1.6121 3.3104 5.1736 3.5568 4.0548 1.6831 3.5181 2.0142 3.1204 4.7114 3.1514 1.5018 1.4355 4.4582 1.3211 1.8797 1.3296 2.3259 2.2593 2.4199 1.6573 1.6968 2.9636 2.0649 1.2680 1.7369 1.4765 1.9842 2.3902 1.2186 1.1042 2.1353 2.6509 1.4899 1.9803 1.4474 2.0703 1.8918 1.7463 1.3081 1.4552 1.5111 1.5838 1.5823 6.1969 1.2417 6.2809 1.1843 2.3964 2.4009 1.0504 1.0621 1.0518 1.0557 2.6968 2.5340 6.7649 6.8486 6.6473 7.1759 10.5068 9.3805 1.0293 1.0376 1.0826 1.0853 1.0877 1.0877 1.0955 1.1046 1.0864 1.0856 1.0895 1.0891 1.1018 1.0945 1.0946 1.1050 1.1003 1.1005
irintensity: 1.7652 0.1582 1.9842 1.0704 0.3838 0.3056 2.1024 0.2070 1.5363 0.3278 0.5650 3.7865 4.1816 3.2431 1.8467 5.2408 13.0526 5.6486 1.1966 5.8697 1.2534 1.3459 2.7713 7.3070 3.2818 11.9507 8.2751 2.4612 1.3165 15.4686 16.1948 8.7592 1.7062 14.6581 3.1750 4.0108 1.8844 6.3905 20.9309 43.5948 73.4119 4.5949 5.3588 4.7346 13.7826 2.3882 20.7644 0.8833 41.1730 88.3442 10.9037 0.4539 2.1391 44.0294 0.3642 80.6962 0.8310 4.2350 11.5815 3.9131 6.9854 5.3314 3.4860 22.3920 0.5628 70.5717 6.4306 1.0170 156.5926 29.9024 5.4978 31.0372 328.6940 76.8070 8.1055 24.4754 6.1639 2.1630 11.9647 7.1604 13.2083 5.9876 3.3329 10.7497 0.9226 55.4495 1.9597 18.7318 7.8033 7.1291 12.3405 25.2252 19.0975 11.4840 18.2034 18.3529 1.6937 0.4216 9.1348 1.4126 171.9786 149.7244 36.9591 2.7549 8.7373 8.9023 8.2174 6.0620 7.7864 23.1222 3.2131 1.2340 5.0856 3.8735 9.9828 0.8883 40.8817 14.5814 38.4148 29.0765
temp: 298.150 k
press: 1.00000 atm
elementType: 8 8 8 8 6 6 6 6 6 6 6 6 6 6 6 6 6 6 6 6 6 6 6 6 1 1 1 1 1 1 1 1 1 1 1 1 1 1 1 1 1 1
symmnumber: 1
zpe: 865083.6 jmol-1
zpe.correction: 0.329493 hartree
zpe.thermalcorrener: 0.350645 hartree
zpe.thermalcorrenthalpy: 0.351589 hartree
zpe.thermalcorrgfe: 0.277129 hartree
zpe.sumelectzpe: -1072.143416 hartree
zpe.sumelectthermal: -1072.122264 hartree
zpe.sumelectthermalent: -1072.121320 hartree
zpe.sumelectthermalfe: -1072.195780 hartree
dipole: 0.5320 1.3207 -0.4443
dipole: 1.4915
quadrupole: -136.1676 -119.2211 -140.9115
quadrupole: 2.1954 13.3094 1.5426
quadrupole: -4.0675 12.8790 -8.8114 2.1954 13.3094 1.5426
hfenergy: -1072.4729093 hartree
pointgroup: C01 [X(C20H18O4)]
dipole: 0.4877034 -0.1800882 0.2721337 debye
polarizability: 225.3014544|2.6313225|235.6950948|-13.2962064|10.1546923|188.0083641 unknown
InChI: InChI=1S/C20H18O4/c1-11(21)24-19-15-10-6-5-9-14(15)16-12-7-3-4-8-13(12)17(19)18(16)20(22)23-2/h3-10,16-19H,1-2H3
charge 0 multiplicity 1
42 atoms
O  0.214298 -2.544908 -0.244848
O  3.3203 -0.013398 1.326822
O  2.180467 1.43998 2.738654
O  -0.575206 -3.545578 -2.205572
C  1.024888 -0.255429 -0.350407
C  0.908755 -0.009547 1.189489
C  -0.279684 0.999996 1.229064
C  -0.154902 -1.166826 -0.767283
C  0.825537 1.159975 -0.896677
C  0.08421 1.918082 0.047478
C  -1.558672 0.245774 0.854213
C  -1.493639 -0.758726 -0.156334
C  2.159372 0.575327 1.833379
C  1.236995 1.728603 -2.113349
C  -0.254056 3.256083 -0.208336
C  -2.807223 0.574145 1.427008
C  -2.682466 -1.394052 -0.587201
C  0.906757 3.084302 -2.374316
C  0.171395 3.839794 -1.430414
C  -3.988821 -0.075518 1.004269
C  -3.926884 -1.057905 -0.011073
C  -0.047711 -3.64129 -1.072947
C  4.591705 0.45857 1.929448
C  0.372103 -4.925103 -0.389978
H  1.975262 -0.722831 -0.649225
H  0.675327 -0.953005 1.719749
H  -0.373357 1.525131 2.192232
H  -0.234209 -1.255341 -1.866144
H  1.811723 1.148192 -2.844255
H  -0.826716 3.844241 0.517271
H  -2.853324 1.344618 2.205977
H  -2.627643 -2.151466 -1.377677
H  1.22759 3.552448 -3.311678
H  -0.069618 4.887008 -1.645589
H  -4.95079 0.18652 1.458848
H  -4.841077 -1.554953 -0.35337
H  4.71076 1.541833 1.760999
H  5.375538 -0.113589 1.413948
H  4.597531 0.258163 3.013983
H  1.348485 -4.80256 0.105889
H  0.414353 -5.740655 -1.12659
H  -0.367158 -5.184503 0.389545
