program: Gaussian 09
title: 000275793
version: EM64L-G09RevD.01
frameworkgroup: C1[X(C17H13Br)]
method: RPBEPBE
basis: SDD
operation: Freq
keyword: #p
keyword: freq=noraman
keyword: PBEPBE/SDD
title: #p freq=noraman PBEPBE/SDD
converged: YES YES NO NO
title: Mulliken charges:
elementType: Br C C C C C C C C C C C C C C C C C H H H H H H H H H H H H H
charge: -0.001638 0.629157 -0.740577 0.459243 0.394728 -0.632407 0.506481 -0.432331 -0.463481 -0.381318 -0.420187 -0.375970 -0.416039 -0.248707 -0.246694 -0.224738 -0.224111 -0.247515 0.248369 0.235373 0.243727 0.239975 0.250637 0.242363 0.239142 0.227217 0.232243 0.231296 0.223448 0.224989 0.227322
chargesum: 0.00000
title: Mulliken charges with hydrogens summed into heavy atoms:
elementType: Br C C C C C C C C C C C C C C C C C
charge: -0.001638 0.629157 -0.256834 0.459243 0.394728 -0.632407 0.506481 -0.188605 -0.223506 -0.130681 -0.177824 -0.136828 -0.188822 -0.016464 -0.015398 -0.001290 0.000878 -0.020193
polarizability: 2.71065345e+02 2.08098287e+01 1.90176577e+02 -2.04274812e+01 7.67149402e+00 1.33553355e+02
1716.lowfreq: -15.8657 -5.3655 -0.9866 -0.0006 0.0003 0.0004 15.7582 27.3665 35.2670
frequency: 12.8479 26.8685 35.1992 84.1986 129.4420 159.0070 184.5761 211.6733 223.4154 288.9727 307.5376 333.1419 404.0379 413.3274 442.9233 449.2229 496.5437 510.9081 520.4436 538.3578 583.5215 614.5684 637.5985 671.3379 702.0604 722.4416 752.2518 765.3103 786.3374 796.2456 806.5081 842.2122 853.5174 884.9331 888.8024 908.3919 944.8807 961.8375 976.4363 978.2896 980.1655 991.0383 995.3660 995.8198 1026.4114 1032.5024 1081.5915 1131.7610 1154.8197 1171.1677 1174.3529 1181.8242 1189.7862 1201.2349 1231.1177 1236.7112 1266.2677 1289.2230 1330.6155 1336.8582 1381.2961 1398.8858 1401.5865 1420.2824 1439.3228 1457.6667 1463.6915 1483.1512 1503.6720 1562.4189 1593.1554 1602.2072 1612.9034 1631.4610 2978.6624 3039.1477 3115.9190 3121.1185 3123.4915 3125.1064 3133.8849 3138.8213 3144.1089 3148.2937 3156.5641 3161.7467 3170.7349
redmass: 4.2761 6.1268 5.5607 5.0595 4.6840 6.5018 7.0547 4.2230 5.3512 4.5524 4.2122 3.4392 2.8176 3.2230 4.0030 2.9435 3.7680 5.1745 6.5786 3.3673 4.2820 6.3564 6.3152 4.3717 2.3093 1.9910 1.6013 1.8838 2.9367 5.7253 2.6387 1.6375 1.2527 2.3180 1.8127 1.8459 2.7186 1.3580 1.4096 1.3946 2.8497 6.0162 1.3658 1.3399 2.2618 2.2117 1.6153 1.8425 1.4780 1.0616 1.1246 1.1578 1.1641 2.1256 1.9423 1.9875 1.5694 1.7182 2.1069 1.3456 7.4669 5.2310 3.3354 2.7592 2.1622 1.9278 1.3513 2.1185 3.5062 7.6581 6.0726 6.1106 6.0244 6.9611 1.0625 1.0974 1.0860 1.0864 1.0866 1.0865 1.0914 1.0894 1.0961 1.0976 1.0948 1.1015 1.0989
irintensity: 0.0890 0.0833 0.1141 0.0375 0.4929 0.3097 0.6211 3.2357 1.4234 2.2075 1.9697 0.2704 0.0444 4.4857 2.5503 5.6499 4.6893 2.3327 1.5668 8.0977 4.3129 0.4780 10.1521 4.4604 24.0343 58.5022 29.4101 33.1477 20.7943 14.0111 10.2697 55.7477 1.1748 8.4981 6.5942 4.3883 7.3438 1.3484 1.9234 1.5382 19.1222 2.2861 1.4607 0.0045 10.8445 7.2863 10.7514 1.4947 2.5550 0.0647 2.7947 1.4085 2.1388 1.6569 12.4695 4.0556 13.5581 1.4626 24.1518 3.4905 0.8723 10.0033 0.0477 0.1764 6.8904 3.6720 18.1899 20.4747 20.6070 10.7010 1.4478 4.2280 13.0388 1.2654 26.3771 7.0047 7.7234 2.0838 4.0592 2.1089 14.8051 10.8108 40.6371 24.5127 22.9315 26.6209 23.0708
temp: 298.150 k
press: 1.00000 atm
elementType: 35 6 6 6 6 6 6 6 6 6 6 6 6 6 6 6 6 6 1 1 1 1 1 1 1 1 1 1 1 1 1
symmnumber: 1
zpe: 636162.5 jmol-1
zpe.correction: 0.242301 hartree
zpe.thermalcorrener: 0.256950 hartree
zpe.thermalcorrenthalpy: 0.257894 hartree
zpe.thermalcorrgfe: 0.197385 hartree
zpe.sumelectzpe: -667.853569 hartree
zpe.sumelectthermal: -667.838921 hartree
zpe.sumelectthermalent: -667.837977 hartree
zpe.sumelectthermalfe: -667.898486 hartree
dipole: -0.8597 -1.5413 -0.1846
dipole: 1.7745
quadrupole: -100.9216 -106.4082 -112.8703
quadrupole: 4.6894 -3.3746 1.1785
quadrupole: 5.8118 0.3252 -6.1369 4.6894 -3.3746 1.1785
hfenergy: -668.0958709 hartree
pointgroup: C01[X(C17H13Br1)]
dipole: -0.3157316 -0.6171339 -0.0826793 debye
polarizability: 269.3554472|24.0999189|191.5691861|-20.5013584|7.865525|133.8706433 unknown
InChI: InChI=1S/C17H13Br/c18-17-15(12-13-6-2-1-3-7-13)11-10-14-8-4-5-9-16(14)17/h1-11H,12H2
charge 0 multiplicity 1
31 atoms
Br 0.034425 2.506145 -0.240939
C  0.077831 -0.280316 -1.08996
C  1.494302 -0.031435 -1.588141
C  -2.048542 0.437946 0.013727
C  -2.583915 -0.900963 -0.173443
C  -0.715437 0.693309 -0.466004
C  2.572815 -0.019352 -0.496741
C  -0.494912 -1.588664 -1.258106
C  -1.779235 -1.893985 -0.817199
C  -2.876361 1.415526 0.659188
C  -3.909569 -1.197391 0.286082
C  2.538023 -0.93215 0.587618
C  3.66061 0.884644 -0.588315
C  -4.16315 1.093572 1.096059
C  -4.689239 -0.223186 0.909717
C  3.569221 -0.943712 1.553717
C  4.69468 0.87465 0.374492
C  4.653665 -0.042119 1.450188
H  1.538936 0.926588 -2.138153
H  1.744034 -0.826133 -2.318935
H  0.113154 -2.353382 -1.755451
H  -2.190409 -2.899569 -0.96154
H  -2.485187 2.425892 0.809577
H  -4.300132 -2.210914 0.136071
H  1.695304 -1.62669 0.684079
H  3.693234 1.606717 -1.413981
H  -4.776521 1.856464 1.587552
H  -5.700387 -0.460295 1.257526
H  3.524783 -1.653252 2.388049
H  5.525828 1.584036 0.28925
H  5.452054 -0.049277 2.200716
