program: Gaussian 09
title: 000277717
version: EM64L-G09RevD.01
frameworkgroup: C1[X(C17H12N2O4)]
method: RPBEPBE
basis: SDD
operation: Freq
keyword: #p
keyword: freq=noraman
keyword: PBEPBE/SDD
title: #p freq=noraman PBEPBE/SDD
converged: YES YES NO NO
title: Mulliken charges:
elementType: O O O O N N C C C C C C C C C C C C C C C C C H H H H H H H H H H H H
charge: -0.186246 -0.191645 -0.196750 -0.184925 -0.336534 0.013770 -0.628407 0.237394 0.151397 0.045162 0.481534 -0.315486 0.324308 -0.340243 -0.348307 0.207848 -0.315961 -0.223917 -0.223399 -0.362168 -0.247737 -0.239776 -0.210846 0.257818 0.284661 0.288239 0.275996 0.269761 0.239162 0.231757 0.230469 0.288015 0.244443 0.231977 0.248638
chargesum: 0.00000
title: Mulliken charges with hydrogens summed into heavy atoms:
elementType: O O O O N N C C C C C C C C C C C C C C C C C
charge: -0.186246 -0.191645 -0.196750 -0.184925 -0.336534 0.013770 -0.085928 0.237394 0.151397 0.045162 0.481534 -0.027247 0.324308 -0.064247 -0.078546 0.207848 -0.076799 0.007840 0.007070 -0.074152 -0.003294 -0.007799 0.037792
polarizability: 3.95395405e+02 -9.15551442e+00 2.24910801e+02 -4.89843906e-01 2.21480846e+00 9.82174443e+01
1716.lowfreq: -5.4144 0.0002 0.0005 0.0010 0.7681 5.4487 14.5501 26.8650 41.9494
frequency: 14.2200 26.8261 41.9400 47.7280 61.5029 84.0852 95.9944 106.6528 136.9414 165.2972 190.8898 217.8626 260.1453 276.8484 295.5338 317.9967 366.6817 380.0232 402.8928 412.1652 432.2072 458.1758 502.2919 512.9219 540.1768 569.7103 578.4213 584.8707 610.4931 617.8713 651.2305 666.2642 678.8237 690.8858 709.3147 719.4561 740.1496 769.4153 781.5504 791.6570 825.5846 836.2397 886.1891 897.8141 915.6087 917.0888 944.8728 969.4983 970.9898 975.7873 990.2407 994.7756 1001.5539 1030.4525 1041.3899 1061.2993 1071.6939 1104.3600 1134.4085 1145.3265 1161.6571 1170.9421 1176.2605 1181.7320 1197.6542 1203.8097 1220.0934 1261.7958 1288.2106 1326.1737 1329.9793 1350.6180 1371.5827 1384.7917 1391.0355 1424.0078 1435.0343 1444.6142 1471.4799 1486.9906 1570.2748 1592.9304 1605.7966 1610.4028 1618.1513 1668.7691 1681.5712 3006.2458 3062.2726 3127.5736 3133.6223 3146.6782 3146.7955 3163.8957 3165.1362 3180.0667 3188.5193 3189.1829 3193.0662
redmass: 7.1638 6.3936 6.4129 5.2848 7.8572 7.2567 3.3765 6.4227 5.4073 6.4246 6.5031 6.7243 5.4793 5.7071 8.5144 6.0020 5.1683 8.2315 2.8277 3.7497 4.7948 6.5495 3.4569 4.0790 3.8726 4.4104 4.6940 6.9700 6.8986 7.0133 7.2441 5.1690 5.2351 1.9675 3.8805 5.8480 4.7207 1.9976 1.7136 3.9228 4.3990 1.2571 1.4287 4.5543 1.4613 1.5194 2.3439 4.0212 1.4100 1.4154 5.8735 1.3275 1.3501 2.2088 2.8908 3.3515 2.8997 1.9957 2.0130 1.3549 2.5405 2.1003 1.0493 1.3974 1.1831 7.3999 2.0624 1.6811 1.6746 4.7509 1.3985 3.6355 3.8336 9.2699 3.0752 1.0849 2.5017 2.3206 2.6224 2.3012 6.0956 6.4007 6.8193 6.0504 11.3139 9.9083 12.2405 1.0625 1.0985 1.0886 1.0856 1.0909 1.0872 1.0973 1.0916 1.0941 1.0983 1.0947 1.0966
irintensity: 0.9491 0.8594 0.7857 0.7831 0.1524 0.8645 9.9057 1.9765 1.6618 0.6825 0.9339 4.4783 1.6068 0.8631 9.8643 4.6403 0.5234 2.0679 0.1871 1.1961 0.5995 9.1016 4.4645 12.2938 11.0182 0.4912 6.3535 28.7641 6.0065 6.5400 19.5538 13.1631 16.8789 50.4020 7.1049 20.4747 4.0828 48.2825 41.3751 37.2587 12.9255 0.1659 5.0293 19.9090 4.6387 12.5927 2.0542 1.6828 0.0845 2.5410 1.2007 0.6480 1.6327 5.9854 2.1636 12.0203 57.7552 47.1408 7.8675 51.3932 66.1297 103.8918 0.1521 98.5615 3.3729 242.0279 16.6315 3.5533 4.6465 340.2810 17.8364 46.1726 70.2427 0.6867 23.8592 7.3982 3.2295 14.8398 84.3069 73.3883 21.3829 22.6762 10.6431 19.1393 325.1822 59.7441 71.2056 4.1062 1.6966 0.8413 0.0238 17.6271 1.9457 39.1463 11.3794 4.3285 9.4409 2.7230 1.9332
temp: 298.150 k
press: 1.00000 atm
elementType: 8 8 8 8 7 7 6 6 6 6 6 6 6 6 6 6 6 6 6 6 6 6 6 1 1 1 1 1 1 1 1 1 1 1 1
symmnumber: 1
zpe: 667233.3 jmol-1
zpe.correction: 0.254136 hartree
zpe.thermalcorrener: 0.273042 hartree
zpe.thermalcorrenthalpy: 0.273986 hartree
zpe.thermalcorrgfe: 0.203912 hartree
zpe.sumelectzpe: -1063.747128 hartree
zpe.sumelectthermal: -1063.728222 hartree
zpe.sumelectthermalent: -1063.727278 hartree
zpe.sumelectthermalfe: -1063.797352 hartree
dipole: 2.3792 -4.9749 -1.0876
dipole: 5.6208
quadrupole: -107.4419 -137.0866 -138.7117
quadrupole: -25.8146 0.5453 6.9685
quadrupole: 20.3048 -9.3399 -10.9649 -25.8146 0.5453 6.9685
hfenergy: -1064.0012638 hartree
pointgroup: C01 [X(C17H12N2O4)]
dipole: -1.0756672 1.9313192 -0.0560173 debye
polarizability: 395.8279216|3.1432577|220.6637432|0.4812145|21.725767|102.0319849 unknown
InChI: InChI=1S/C17H12N2O4/c20-16-11-13(10-12-6-4-5-9-15(12)19(22)23)17(21)18(16)14-7-2-1-3-8-14/h1-10H,11H2
charge 0 multiplicity 1
35 atoms
O  2.134997 2.284112 1.606282
O  1.221484 -1.227517 -1.420044
O  -4.73828 -2.995516 -0.225422
O  -2.52155 -2.670277 0.18459
N  2.046183 0.46358 0.064188
N  -3.711359 -2.229589 -0.063781
C  -0.028294 1.502066 0.669229
C  -0.293933 0.319659 -0.233987
C  1.491047 1.500469 0.872579
C  1.020197 -0.271262 -0.632686
C  3.456296 0.170978 -0.031042
C  -1.451773 -0.2998 -0.612702
C  -2.82961 0.142372 -0.326579
C  3.890265 -1.172378 -0.158279
C  4.400264 1.227428 0.008258
C  -3.924031 -0.759298 -0.139707
C  -3.157414 1.529385 -0.321605
C  5.27024 -1.450542 -0.249593
C  5.777262 0.932848 -0.077446
C  -5.254508 -0.317395 0.027786
C  -4.477318 1.986124 -0.139117
C  6.219151 -0.403523 -0.208229
C  -5.534492 1.061793 0.034138
H  -0.302821 2.476863 0.225065
H  -0.539434 1.440799 1.646373
H  -1.320686 -1.22355 -1.189694
H  3.161226 -1.984066 -0.200333
H  4.064613 2.260474 0.119893
H  -2.363181 2.255825 -0.511528
H  5.601497 -2.489529 -0.350924
H  6.503915 1.751628 -0.04293
H  -6.041684 -1.064096 0.159603
H  -4.683512 3.061427 -0.145884
H  7.289412 -0.62621 -0.276805
H  -6.56217 1.410821 0.172828
