program: Gaussian 09
title: 000277715
version: EM64L-G09RevD.01
frameworkgroup: C1[X(C9H9NO2)]
method: RPBEPBE
basis: SDD
operation: Freq
keyword: #pfreq=noraman
keyword: PBEPBE/SDD
title: #p freq=noraman PBEPBE/SDD
converged: NO YES NO NO
title: Mulliken charges:
elementType: O O N C C C C C C C C C H H H H H H H H H
charge: -0.226965 -0.236243 -0.428547 -0.546503 0.206829 -0.315099 -0.412182 0.129069 0.421512 -0.360517 -0.224030 -0.281584 0.245170 0.245155 0.228574 0.228546 0.250691 0.318908 0.249842 0.258193 0.249182
chargesum: 0.00000
title: Mulliken charges with hydrogens summed into heavy atoms:
elementType: O O N C C C C C C C C C
charge: -0.226965 -0.236243 -0.109639 -0.056178 0.206829 0.142022 -0.161491 0.129069 0.421512 -0.110675 0.034162 -0.032401
polarizability: 2.04793066e+02 -3.04088821e-01 1.12341390e+02 -6.31292168e-02 2.77921967e-02 5.21806526e+01
1716.lowfreq: -2.2791 -0.0001 0.0005 0.0008 8.5040 11.5909 13.2746 84.5045 100.4263
frequency: 11.3324 84.4902 100.4261 104.6775 160.8620 235.4935 279.0112 301.7213 445.9293 511.9258 591.8671 615.9611 626.4238 653.8261 684.8017 688.2058 736.4909 737.2375 788.2049 804.3013 830.9931 873.0778 883.4867 935.0260 936.3772 946.9976 995.0065 1008.2318 1043.9500 1055.2895 1097.8518 1136.4022 1154.4058 1169.5164 1202.5957 1238.7531 1278.0016 1282.5996 1336.6619 1375.0902 1404.5318 1425.4139 1453.4753 1461.6094 1487.6350 1556.5336 1652.4804 1677.8362 2981.3068 3029.3855 3030.4017 3081.1345 3095.0364 3214.1618 3232.1579 3246.8435 3592.0527
redmass: 2.3339 5.4965 2.7493 4.8075 5.1910 7.0280 5.1802 4.9908 2.8171 8.3483 2.1572 1.5018 8.4341 2.8749 6.7081 5.1645 1.2449 5.4794 5.9016 1.4159 1.2340 5.6745 1.3420 4.7183 1.4279 3.3010 3.1328 4.2774 1.6236 1.3125 2.0935 1.3816 2.5148 1.1265 1.1124 1.9245 1.6332 2.1680 1.3468 2.0939 2.9570 2.9574 4.0048 1.1233 1.0861 3.8248 10.9908 10.2064 1.0594 1.1035 1.0583 1.0884 1.1105 1.0903 1.0971 1.1084 1.0814
irintensity: 5.7310 0.4892 1.7371 5.0220 2.7660 2.3791 1.8457 0.4000 3.2842 2.6604 48.0620 17.5300 3.4699 56.8349 0.5644 0.6601 118.8922 35.0341 3.4289 14.7791 0.6545 16.1218 0.3513 40.6396 15.6724 18.9792 141.3662 75.4059 0.0225 40.9635 15.2777 19.6790 311.6292 0.5876 0.5112 48.6591 4.2133 49.2998 9.0735 1.2450 5.9815 2.1855 121.3844 0.3271 2.8946 2.6507 563.9155 79.5245 9.2080 7.8737 66.7158 2.5232 29.4981 4.2960 2.0130 1.2962 59.0504
temp: 298.150 k
press: 1.00000 atm
elementType: 8 8 7 6 6 6 6 6 6 6 6 6 1 1 1 1 1 1 1 1 1
symmnumber: 1
zpe: 428056.7 jmol-1
zpe.correction: 0.163038 hartree
zpe.thermalcorrener: 0.173340 hartree
zpe.thermalcorrenthalpy: 0.174284 hartree
zpe.thermalcorrgfe: 0.124809 hartree
zpe.sumelectzpe: -552.682351 hartree
zpe.sumelectthermal: -552.672050 hartree
zpe.sumelectthermalent: -552.671106 hartree
zpe.sumelectthermalfe: -552.720581 hartree
dipole: -5.2131 -2.8536 0.0056
dipole: 5.9430
quadrupole: -73.6224 -63.9957 -72.3983
quadrupole: -18.6307 -0.0436 0.0250
quadrupole: -3.6169 6.0098 -2.3928 -18.6307 -0.0436 0.0250
hfenergy: -552.8453895 hartree
pointgroup: C01 [X(C9H9N1O2)]
dipole: 2.0922657 -1.0313327 -0.1606864 debye
dipolederiv: -1.0350572 -0.4739256 -0.0154628 -0.3990715 -1.0120752 -0.0473944 -0.0107464 -0.0462301 -0.3030601 -0.7944289 0.1644081 0.029505 0.577722 -1.1354171 -0.088339 0.062993 -0.0722872 -0.346138 0.4079107 0.1470538 -0.0109026 0.0417251 -0.5919688 -0.0302241 -0.0197337 -0.034444 -0.2449981 0.0437604 0.0480808 0.0079832 -0.1557016 -0.1283887 -0.0204563 -0.0087483 -0.0270514 0.1709593 -1.5879431 0.1101309 0.0604252 0.2259029 0.0756949 0.0062376 0.0706681 0.0099686 -0.0920572 0.2473208 -0.1233576 -0.0075243 0.2705765 0.6146117 0.0133607 0.0259546 0.0262223 0.3522161 1.237366 -0.1224501 -0.0558347 -0.0813247 0.0241794 0.0114066 -0.0527922 0.0126814 -0.0742983 2.2255596 0.266312 -0.0441668 -0.5772318 1.5756049 0.1347322 -0.1129243 0.1055701 0.2497901 -0.741306 0.1785062 0.0400321 0.5582351 0.2162841 -0.0010647 0.0722568 0.0122019 -0.0133681 0.4682364 0.0090258 -0.0233065 -0.2366049 -0.0851647 0.0185115 -0.044557 0.0100467 -0.2076662 -0.5103799 -0.2133399 -0.0061018 0.4344982 0.3033714 0.0239231 0.0477549 0.0467373 -0.1698369 -0.4434736 -0.0629998 0.0016129 -0.4706421 -0.0683712 0.0304106 -0.0307709 0.0162472 -0.2364459 0.0267724 0.0525893 0.0742562 -0.0254085 0.0309829 -0.0475468 0.0385673 -0.0761051 -0.0444366 0.0196697 0.0691739 -0.0671172 -0.0152897 0.0083936 0.0579277 -0.0455916 0.0808093 -0.0152457 0.033833 -0.0064731 -0.0508569 -0.065926 -0.0297938 -0.061822 -0.1115195 -0.1204141 -0.0655703 0.0434564 -0.0068202 0.0439048 -0.079291 -0.0617964 0.0681751 0.0933134 0.1224567 -0.0432179 0.0706578 -0.0131929 0.0016843 -0.0115134 -0.0506859 -0.0164518 0.0014662 -0.0161802 0.1488121 0.1979608 0.0481639 0.0090334 0.0556051 0.2144864 -0.0118283 0.0096425 -0.0113807 0.3348556 0.074096 -0.0932045 -0.0036564 -0.0711222 0.005021 -0.0119535 -0.0018792 -0.0112883 0.1808196 0.0146049 -0.0549068 0.0030439 -0.0680539 0.0605187 -0.0107075 0.001811 -0.0112096 0.2207521 0.001384 0.0772257 0.013449 0.0929166 0.0345128 -0.0168968 0.0148354 -0.0163508 0.1981341 unknown
polarizability: 204.4431786|4.3608138|112.1153063|-4.9311826|4.8486904|52.7566233 unknown
InChI: InChI=1S/C9H9NO2/c11-9-7(3-5-12-9)6-8-2-1-4-10-8/h1-2,4,6,10H,3,5H2
charge 0 multiplicity 1
21 atoms
O  -3.366282 -0.283316 0.182287
O  -2.615634 1.920337 0.345756
N  2.563247 1.200433 0.104009
C  -1.215549 -1.461494 0.014523
C  -1.027438 0.033251 0.134518
C  -2.764137 -1.639489 0.047732
C  0.127663 0.773748 0.156813
C  -2.346521 0.706082 0.23516
C  1.483709 0.294007 0.069051
C  2.059714 -0.99846 -0.057884
C  3.767566 0.52294 0.004772
C  3.479621 -0.851323 -0.097392
H  -0.782543 -1.852979 -0.925538
H  -0.727805 -2.002959 0.847215
H  -3.164191 -2.078492 -0.881119
H  -3.108027 -2.231301 0.912015
H  -0.017618 1.861638 0.25271
H  2.457829 2.210724 0.189733
H  1.510265 -1.935441 -0.115003
H  4.722309 1.044762 0.012658
H  4.215822 -1.647967 -0.189318
