program: Gaussian 09
title: 000277708
version: EM64L-G09RevD.01
frameworkgroup: C1[X(C12H11NO3S)]
method: RPBEPBE
basis: SDD
operation: Freq
keyword: #p
keyword: freq=noraman
keyword: PBEPBE/SDD
title: #p freq=noraman PBEPBE/SDD
converged: YES YES NO NO
title: Mulliken charges:
elementType: S O O O N C C C C C C C C C C C C H H H H H H H H H H H
charge: 0.189200 -0.264907 -0.265723 -0.166486 -0.684176 -0.433904 0.346154 0.301505 -0.723455 -0.414607 0.142384 0.362228 0.228920 -0.481051 -0.304679 -0.549995 -0.201914 0.253099 0.224923 0.282009 0.266530 0.264033 0.262819 0.246641 0.239272 0.239615 0.310639 0.330925
chargesum: 0.00000
title: Mulliken charges with hydrogens summed into heavy atoms:
elementType: S O O O N C C C C C C C C C C C C
charge: 0.189200 -0.264907 -0.265723 -0.166486 -0.042612 0.044119 0.346154 0.301505 -0.174916 -0.150574 0.142384 0.362228 0.228920 -0.218232 -0.304679 -0.303354 0.276973
polarizability: 3.20242999e+02 1.58602089e+00 1.47958940e+02 2.15707313e+00 5.56789267e+00 1.05091210e+02
1716.lowfreq: -66.9541 -5.7076 -0.0017 0.0009 0.0016 5.1822 6.9635 39.2577 51.0115
frequency: -66.9452 39.2531 50.8919 67.3277 112.3322 147.6734 172.4812 181.9995 197.3170 262.3669 286.2438 316.1697 330.5071 382.5889 385.8337 395.8310 423.3491 445.5589 450.3717 471.4488 502.4705 555.3251 622.1446 625.8186 648.6210 676.2596 677.5529 695.9170 711.7816 745.6294 767.3880 804.8067 832.7136 841.1106 848.8824 869.6043 898.3769 920.2380 976.6426 986.5037 1001.1308 1034.4448 1041.2931 1063.9406 1118.5292 1128.2274 1137.9063 1178.2575 1197.7887 1227.5783 1253.4025 1275.3714 1289.4067 1313.8720 1360.9069 1369.5788 1430.2831 1435.7886 1445.9136 1461.2648 1479.7718 1489.6551 1584.9273 1619.2649 1630.2485 1636.3756 1643.5079 2972.6552 3013.5293 3042.1371 3060.4566 3079.4160 3091.4336 3124.0903 3164.2545 3168.9700 3548.0697 3689.8145
redmass: 2.3571 6.6197 5.9310 7.2513 5.5817 4.0198 3.2862 4.9717 8.4256 5.8849 5.1563 3.8834 3.0176 1.8887 3.5635 2.9353 3.6823 2.0060 2.0181 5.6277 3.8486 5.0167 5.7662 5.3519 8.5662 4.3749 9.5375 4.1585 6.0408 6.9524 4.3175 3.8339 1.5605 2.9884 2.8961 1.4340 2.7472 1.8719 5.5466 1.5514 2.5695 3.6061 1.6906 1.4564 1.0368 1.4553 1.8752 1.5434 1.5570 2.2926 1.9380 1.3110 3.3146 1.3008 1.3777 1.6229 4.0764 1.5722 2.4352 1.1171 1.6241 1.8558 9.4195 6.7018 2.3127 2.9155 3.7906 1.0660 1.0534 1.0624 1.0906 1.0876 1.1189 1.1088 1.0926 1.0930 1.0451 1.1037
irintensity: 14.5814 0.7393 2.4807 1.5788 1.5665 3.0607 0.4854 1.4753 0.3997 0.9748 1.5524 5.3859 8.9789 97.2673 14.1767 28.0615 48.6144 19.9416 43.5211 2.9928 54.0255 43.8554 6.1136 16.9864 9.9711 5.6984 0.3636 10.9222 15.8172 6.2355 6.7046 15.1970 30.2020 29.5754 29.1065 13.3429 102.6340 131.9613 176.2191 10.8994 18.4598 5.9648 11.4989 4.1203 0.1413 55.9847 168.9359 74.3424 202.6446 41.2377 0.2148 28.5899 121.2000 4.9120 16.7109 21.9506 4.4011 6.7604 72.2080 4.4632 131.0924 116.9903 507.7799 45.8398 58.7871 129.3713 143.3355 13.9985 155.0187 21.1273 16.2201 1.7571 31.1745 12.8101 5.1347 2.0451 41.3841 28.4168
temp: 298.150 k
press: 1.00000 atm
elementType: 16 8 8 8 7 6 6 6 6 6 6 6 6 6 6 6 6 1 1 1 1 1 1 1 1 1 1 1
symmnumber: 1
zpe: 545083.2 jmol-1
zpe.correction: 0.207611 hartree
zpe.thermalcorrener: 0.222144 hartree
zpe.thermalcorrenthalpy: 0.223089 hartree
zpe.thermalcorrgfe: 0.165411 hartree
zpe.sumelectzpe: -1141.112609 hartree
zpe.sumelectthermal: -1141.098076 hartree
zpe.sumelectthermalent: -1141.097132 hartree
zpe.sumelectthermalfe: -1141.154809 hartree
dipole: 4.3942 4.5516 1.1595
dipole: 6.4320
quadrupole: -114.5843 -102.6333 -104.5934
quadrupole: -13.1708 -4.6805 -6.0848
quadrupole: -7.3140 4.6371 2.6769 -13.1708 -4.6805 -6.0848
hfenergy: -1141.3202205 hartree
pointgroup: C01 [X(C12H11N1O3S1)]
dipole: 1.8300042 -1.2067631 -1.2643182 debye
polarizability: 319.9005007|7.3499972|131.5078779|3.433381|21.7917182|121.8847717 unknown
InChI: InChI=1S/C12H11NO3S/c13-9-5-11-10(15-6-16-11)4-8(9)3-7-1-2-17-12(7)14/h3-5H,1-2,6,13H2
charge 0 multiplicity 1
28 atoms
S  -4.957965 0.190762 -0.622286
O  3.592908 1.8523 0.421017
O  4.331279 -0.237876 -0.51318
O  -3.845788 0.775918 1.845091
N  -0.115967 -2.32324 -0.091498
C  -2.40529 -0.656694 -1.268264
C  -2.298124 -0.023065 0.104141
C  0.2465 0.056169 0.461983
C  -3.650807 -0.061639 -1.969888
C  -1.156431 0.318388 0.800061
C  2.510204 0.932918 0.327272
C  0.726366 -1.213308 -0.031912
C  2.952292 -0.292582 -0.224447
C  1.185622 1.121104 0.689134
C  -3.613863 0.374326 0.683535
C  2.101556 -1.377699 -0.401887
C  4.774839 1.128431 -0.103755
H  -1.493416 -0.483524 -1.865813
H  -2.532666 -1.755812 -1.192798
H  -3.436028 0.923377 -2.413848
H  -4.069036 -0.734636 -2.732918
H  -1.329693 0.930969 1.698908
H  0.839293 2.07284 1.10164
H  2.473302 -2.332498 -0.784243
H  5.160806 1.654769 -0.993612
H  5.52758 1.028068 0.697102
H  0.260378 -3.236103 -0.332657
H  -1.034049 -2.283161 0.343824
