program: Gaussian 09
title: 000277706
version: EM64L-G09RevD.01
frameworkgroup: C1[X(C18H14O2)]
method: RPBEPBE
basis: SDD
operation: Freq
keyword: #pfreq=noraman
keyword: PBEPBE/SDD
title: #p freq=noraman PBEPBE/SDD
converged: NO YES NO NO
title: Mulliken charges:
elementType: O O C C C C C C C C C C C C C C C C C C H H H H H H H H H H H H H H
charge: -0.404493 -0.214970 0.240448 0.250493 0.283756 -0.041811 0.154470 -0.384964 0.043413 -0.380194 0.311233 -0.391260 -0.376629 -0.342973 -0.257713 -0.276950 -0.404099 -0.798673 -0.251511 -0.230827 0.274394 0.266017 0.257798 0.183774 0.261424 0.234127 0.233472 0.234547 0.234183 0.263718 0.209618 0.232759 0.229260 0.358163
chargesum: 0.00000
title: Mulliken charges with hydrogens summed into heavy atoms:
elementType: O O C C C C C C C C C C C C C C C C C C
charge: -0.046330 -0.214970 0.240448 0.250493 0.283756 -0.041811 0.154470 -0.110569 0.043413 -0.114177 0.311233 -0.133462 -0.192855 -0.081549 -0.023585 -0.043478 -0.169552 -0.091154 -0.018753 -0.001567
polarizability: 2.76075599e+02 -6.43227999e+00 2.14574968e+02 1.67264037e+01 -7.86892254e-01 1.33034510e+02
1716.lowfreq: -3.6353 -0.0007 -0.0004 0.0002 2.8861 8.6606 34.5497 43.0131 52.1781
frequency: 34.3909 42.9999 52.1676 96.6513 106.4103 151.2049 159.8570 166.6995 201.5869 214.2378 240.2466 285.0919 294.1639 313.4366 360.3838 397.8888 405.1295 419.1524 453.1158 467.0083 472.3703 498.6648 515.0991 531.3076 559.3978 589.3466 627.5175 647.5771 669.7925 705.7878 710.8346 743.6209 759.2169 775.8488 777.9804 788.8326 800.7916 851.7899 856.6318 880.8243 890.4318 947.3773 959.8721 967.5235 989.1416 994.5898 995.9621 1001.5923 1034.0291 1045.3183 1048.6073 1049.1201 1116.4593 1136.3140 1155.0916 1163.7444 1176.6268 1186.0458 1200.2998 1216.0614 1260.9075 1282.8997 1285.8855 1291.3472 1369.5970 1372.4332 1387.8714 1406.2422 1408.7460 1424.3637 1444.6978 1451.4066 1457.4033 1472.3317 1474.7585 1522.2598 1527.2134 1575.9950 1586.8330 1600.4275 1606.4560 1629.3583 2990.6052 3078.5450 3087.5222 3088.8377 3120.4160 3133.7404 3137.6797 3145.7321 3155.0119 3158.2945 3163.9328 3176.1151 3178.2731 3587.6788
redmass: 6.0176 3.9912 5.2767 5.7821 3.0970 1.7286 1.7901 3.3119 4.8846 4.5816 4.1254 2.0648 2.2951 6.2184 7.1760 3.0749 4.3722 2.6150 3.5601 4.7005 4.1963 4.0252 5.0128 5.1913 5.3417 4.2323 4.3428 4.1470 5.3554 6.1357 3.9840 1.6130 1.5227 4.0229 3.1489 4.0848 2.6749 1.5117 1.8026 1.3687 4.1265 1.3835 1.3940 1.4408 1.3469 1.5403 1.3788 3.8585 3.7937 1.6092 2.2119 2.3087 2.0575 1.5048 1.5406 1.6257 1.0683 1.1048 1.9487 2.3489 2.1141 1.6209 2.2328 2.0637 6.7633 3.8364 2.3514 1.2264 6.7695 1.9293 2.6106 2.7563 1.0931 1.1529 2.6100 4.1345 7.5158 6.3392 6.8257 6.1949 6.0087 6.3395 1.0365 1.0963 1.1010 1.0878 1.0866 1.0883 1.0880 1.0940 1.0891 1.0949 1.1007 1.0971 1.0959 1.0654
irintensity: 1.5895 0.0958 0.5375 3.4279 4.5521 0.6149 0.3192 1.5501 1.4586 1.4289 3.4032 56.0665 41.4766 7.7587 1.1688 0.6343 5.4440 30.9528 11.5423 0.5482 1.4253 17.4455 2.1230 8.0809 1.4962 37.0182 4.4936 0.7767 13.8156 15.3663 2.3250 39.3391 104.6562 8.1628 12.2489 4.1386 14.3269 33.4258 0.7023 4.0256 18.9025 0.7447 3.3949 6.1000 0.3326 0.3088 0.8551 29.6993 4.0479 18.7063 2.3835 3.2205 28.1966 300.8825 15.5137 11.6488 1.9881 7.7509 3.8670 3.7777 315.3808 22.1659 7.1074 55.3035 5.0697 28.9718 13.8565 24.8533 9.4945 3.6423 5.9334 14.2071 14.6493 29.9191 10.6567 141.3048 118.6750 66.3132 29.7387 54.9907 17.3383 10.0109 23.7695 9.4274 30.3264 21.0511 8.9832 5.7258 7.6273 32.0510 0.7714 21.5561 24.1232 13.6595 5.3390 41.7940
temp: 298.150 k
press: 1.00000 atm
elementType: 8 8 6 6 6 6 6 6 6 6 6 6 6 6 6 6 6 6 6 6 1 1 1 1 1 1 1 1 1 1 1 1 1 1
symmnumber: 1
zpe: 693481.7 jmol-1
zpe.correction: 0.264133 hartree
zpe.thermalcorrener: 0.280821 hartree
zpe.thermalcorrenthalpy: 0.281765 hartree
zpe.thermalcorrgfe: 0.219519 hartree
zpe.sumelectzpe: -843.398533 hartree
zpe.sumelectthermal: -843.381845 hartree
zpe.sumelectthermalent: -843.380901 hartree
zpe.sumelectthermalfe: -843.443147 hartree
dipole: 0.8263 4.4223 0.6378
dipole: 4.5438
quadrupole: -99.7602 -114.9727 -116.2401
quadrupole: 1.9281 0.5996 -2.7440
quadrupole: 10.5642 -4.6484 -5.9158 1.9281 0.5996 -2.7440
hfenergy: -843.662666 hartree
pointgroup: C01 [X(C18H14O2)]
dipole: 0.432464 0.8656313 1.503149 debye
polarizability: 269.3925011|-31.2133856|173.5266757|11.8402583|38.8123331|180.7659002 unknown
InChI: InChI=1S/C18H14O2/c1-12-6-2-3-7-13(12)18(20)16-10-11-17(19)15-9-5-4-8-14(15)16/h2-11,19H,1H3
charge 0 multiplicity 1
34 atoms
O  4.516494 -1.667037 -0.093534
O  -1.38609 -0.814951 -2.406463
C  1.205883 0.192866 -0.018699
C  0.441694 -0.709276 -0.856355
C  2.603264 -0.102181 0.253681
C  -1.010066 -0.538756 -1.221295
C  -2.021411 -0.146015 -0.177241
C  1.090026 -1.817606 -1.4344
C  3.188942 -1.289719 -0.323583
C  0.670118 1.41635 0.511825
C  -3.197199 0.599181 -0.519283
C  2.445387 -2.122285 -1.166229
C  3.370823 0.800058 1.062208
C  -1.839158 -0.611151 1.15488
C  1.444001 2.278853 1.290181
C  2.806829 1.966751 1.579563
C  -4.135182 0.866792 0.510168
C  -3.47102 1.113103 -1.921152
C  -2.799365 -0.357588 2.153887
C  -3.95237 0.392717 1.828633
H  0.510809 -2.463459 -2.101564
H  -0.367159 1.680878 0.293501
H  2.926851 -3.003237 -1.598958
H  4.429183 0.599571 1.280534
H  -0.939034 -1.186221 1.396555
H  1.005703 3.204829 1.677324
H  3.40784 2.647248 2.191701
H  -5.029757 1.452521 0.266563
H  -2.573188 1.553681 -2.388553
H  -3.776661 0.286325 -2.585887
H  -4.273342 1.871644 -1.904841
H  -2.650257 -0.735875 3.17085
H  -4.70474 0.608817 2.595747
H  4.978051 -1.043228 0.518937
