program: Gaussian 09
title: 000277701
version: EM64L-G09RevD.01
frameworkgroup: C1[X(C9H8O2S)]
method: RPBEPBE
basis: SDD
operation: Freq
keyword: #pfreq=noraman
keyword: PBEPBE/SDD
title: #p freq=noraman PBEPBE/SDD
converged: YES YES NO NO
title: Mulliken charges:
elementType: S O O C C C C C C C C C H H H H H H H H
charge: 0.271736 -0.222298 -0.222770 -0.548883 0.205290 -0.315219 0.134735 -0.249725 -0.130110 -0.272000 -0.147035 -0.512496 0.247678 0.247877 0.230813 0.231536 0.270130 0.258547 0.249993 0.272200
chargesum: 0.00000
title: Mulliken charges with hydrogens summed into heavy atoms:
elementType: S O O C C C C C C C C C
charge: 0.271736 -0.222298 -0.222770 -0.053328 0.205290 0.147130 0.134735 0.020406 -0.130110 -0.013453 0.102958 -0.240296
polarizability: 2.14035356e+02 1.26491567e+00 1.24143650e+02 3.67642344e-01 -9.77461104e-01 5.33605669e+01
1716.lowfreq: -10.9451 -7.7220 -2.8484 -0.0019 -0.0009 -0.0009 17.3151 81.3810 99.3418
frequency: 13.0113 81.3722 99.3106 108.4673 155.2946 229.9970 245.4873 261.2341 411.0634 497.1833 498.6182 571.8992 583.2446 615.1058 675.1055 680.7769 689.4547 707.9085 740.3350 791.7910 819.7262 824.2682 837.4195 913.0324 933.0479 942.6364 979.7504 1003.9893 1044.0719 1052.0509 1082.7195 1127.5936 1170.6897 1184.7421 1207.4821 1249.8366 1272.2112 1334.7640 1352.4779 1378.4593 1456.8598 1459.7025 1486.4844 1531.6968 1641.6243 1674.9342 2981.1970 3029.5415 3037.0661 3098.0904 3101.9198 3179.2106 3205.5380 3239.6600
redmass: 3.4498 5.8884 2.9572 3.7381 5.3017 6.8348 8.6732 5.1441 3.7619 7.0791 3.6542 9.8075 2.9105 8.3229 5.6218 6.8372 7.0882 1.1698 7.4600 5.0251 1.3478 4.6802 1.2986 1.3624 4.5949 1.4086 5.3490 4.2882 1.6450 1.9531 1.2356 1.5588 1.1170 3.6316 1.2811 1.4459 1.4706 1.3800 2.4505 1.6637 2.9721 1.3547 1.0857 5.4322 9.7457 11.8670 1.0606 1.0773 1.0834 1.0888 1.1095 1.0902 1.0961 1.1000
irintensity: 1.5264 1.2603 0.4672 2.1431 2.0624 4.3378 0.3758 1.2503 0.0911 5.5856 9.7194 3.5897 8.3034 7.5191 13.7755 8.5372 1.2099 102.9497 42.4503 1.2392 10.1587 9.4808 3.0474 0.0967 34.5504 11.2177 172.7242 25.2969 2.9417 19.8993 3.8648 20.7102 0.5770 301.3785 44.6210 12.0369 23.1602 11.8127 7.2349 1.2922 48.4303 2.6378 3.0841 0.9478 241.2584 233.1193 9.3064 31.9512 35.8318 0.1084 26.3185 7.0998 2.3662 0.9419
temp: 298.150 k
press: 1.00000 atm
elementType: 16 8 8 6 6 6 6 6 6 6 6 6 1 1 1 1 1 1 1 1
symmnumber: 1
zpe: 385742.8 jmol-1
zpe.correction: 0.146922 hartree
zpe.thermalcorrener: 0.157580 hartree
zpe.thermalcorrenthalpy: 0.158524 hartree
zpe.thermalcorrgfe: 0.108150 hartree
zpe.sumelectzpe: -895.379896 hartree
zpe.sumelectthermal: -895.369238 hartree
zpe.sumelectthermalent: -895.368293 hartree
zpe.sumelectthermalfe: -895.418667 hartree
dipole: 3.9527 5.5375 0.1749
dipole: 6.8058
quadrupole: -80.1597 -75.5336 -78.9465
quadrupole: -12.2473 -0.7025 -0.4586
quadrupole: -1.9464 2.6796 -0.7332 -12.2473 -0.7025 -0.4586
hfenergy: -895.5268175 hartree
pointgroup: C01 [X(C9H8O2S1)]
dipole: 1.7640405 -2.0134478 0.0611179 debye
dipolederiv: 0.1224573 0.0590886 -0.0018009 -0.0562609 -0.2574874 0.0264194 0.013659 0.031053 0.1366634 -1.0019047 -0.4833062 -0.048373 -0.3533259 -1.0180036 -0.049819 -0.0298912 -0.0220539 -0.3011779 -0.787081 0.1609036 -0.0226834 0.5058921 -1.0861699 0.0086876 -0.0254607 -0.0031975 -0.3309021 0.0390789 0.0595342 -0.010718 -0.1883429 -0.1510844 -0.0095895 0.0359945 0.0162045 0.1656147 -1.3518061 0.0609098 -0.0681682 0.3383668 0.1221471 0.0031636 -0.1014898 -0.0136679 -0.0768112 0.2629527 -0.1261909 -0.0177753 0.2467906 0.6162612 0.0413011 -0.0041086 0.0030482 0.3497766 2.1274306 0.2965974 0.1113239 -0.5105877 1.5404373 0.0021223 0.1008447 0.023552 0.2506281 0.8058336 -0.073086 0.0464667 -0.18177 -0.0275659 -0.0058601 0.0574647 -0.0004382 -0.0564657 -0.1853008 0.2515617 -0.0232425 0.6017255 0.2367285 -0.0034846 -0.0423185 -0.0206984 -0.1442085 0.2532293 0.0727797 0.0077634 -0.1778823 -0.1865693 -0.0077915 0.018435 0.0005712 -0.1476075 -0.3344817 -0.1525046 0.0009588 -0.3457006 -0.1276554 -0.0171964 0.0253399 -0.0056156 -0.1412121 -0.2855676 -0.1821509 0.0084276 0.2761211 0.3076677 -0.031405 -0.0210831 -0.0522585 -0.2994358 -0.0029322 0.0746759 0.0721998 0.0009568 0.0238273 -0.0497415 0.046967 -0.0651649 -0.0004732 0.0354006 0.0419223 -0.0618429 -0.0349532 0.0288537 0.0507222 -0.0476836 0.0740346 -0.048807 0.0544999 0.0176632 -0.0306758 -0.0476428 -0.0304822 -0.0620613 -0.0932446 -0.1224642 -0.0889278 0.0259987 -0.0258175 0.0501763 -0.085414 -0.0534257 0.0582268 0.0952038 0.1128378 -0.0120677 0.0832818 -0.0153432 -0.002176 0.0003429 0.0014859 0.0036166 -0.0106018 0.0037312 0.1502446 0.0793575 -0.0750765 0.0050988 -0.0977015 -0.0105306 0.0118592 0.0053706 0.0126727 0.1813319 0.046273 0.0528076 -0.0095815 0.1057227 -0.0197643 0.0207049 -0.0112042 0.0190232 0.1937474 0.0132803 -0.014968 -0.0053776 0.0036634 0.0913301 0.0101251 -0.0121932 0.0088306 0.22009 unknown
polarizability: 213.0827085|7.8043483|124.7019692|7.0151821|-2.3301343|53.7548955 unknown
InChI: InChI=1S/C9H8O2S/c10-9-7(3-4-11-9)6-8-2-1-5-12-8/h1-2,5-6H,3-4H2
charge 0 multiplicity 1
20 atoms
S  2.791722 1.584092 0.004158
O  -3.390195 -0.27966 -0.173097
O  -2.664469 1.936085 -0.1229
C  -1.236123 -1.445562 -0.034116
C  -1.053657 0.054295 -0.059914
C  -2.76982 -1.632944 -0.235193
C  -2.38417 0.721858 -0.121074
C  0.089578 0.812931 -0.027332
C  1.454025 0.345328 0.05077
C  2.004632 -0.940268 0.167428
C  3.437703 -0.96482 0.216654
C  4.017784 0.296009 0.13878
H  -0.659781 -1.94861 -0.832651
H  -0.902722 -1.873946 0.930923
H  -3.016267 -2.05639 -1.223485
H  -3.241569 -2.238548 0.554568
H  -0.072322 1.90048 -0.06388
H  1.397945 -1.844917 0.22602
H  4.023195 -1.882547 0.307746
H  5.072509 0.564633 0.152194
