program: Gaussian 09
title: 000277673
version: EM64L-G09RevD.01
frameworkgroup: C1[X(C9H6Cl2O3)]
method: RPBEPBE
basis: SDD
operation: Freq
keyword: #p
keyword: freq=noraman
keyword: PBEPBE/SDD
title: #p freq=noraman PBEPBE/SDD
converged: YES YES NO NO
title: Mulliken charges:
elementType: Cl Cl O O O C C C C C C C C C H H H H H H
charge: -0.003171 0.016400 -0.189924 -0.425627 -0.193384 0.343049 0.133091 -0.599833 -0.307233 -0.362687 -0.097400 -0.203734 -0.110020 0.205705 0.261717 0.281778 0.308587 0.288490 0.267048 0.387149
chargesum: 0.00000
title: Mulliken charges with hydrogens summed into heavy atoms:
elementType: Cl Cl O O O C C C C C C C C C
charge: -0.003171 0.016400 -0.189924 -0.038478 -0.193384 0.343049 0.133091 -0.056339 0.001354 -0.074197 -0.097400 0.063314 -0.110020 0.205705
polarizability: 1.76554722e+02 1.43456712e+01 1.38517354e+02 7.30828913e+00 -5.41785672e+00 6.64254576e+01
1716.lowfreq: -9.5795 -4.9720 0.0020 0.0024 0.0026 4.2634 24.4493 33.6903 63.0530
frequency: 24.3789 33.6869 63.0391 84.5962 115.8302 144.0873 178.4408 185.0536 272.2898 286.3229 325.5321 378.3120 408.2509 438.7308 445.3419 485.7533 510.3846 548.9390 579.5569 619.1217 657.2613 663.4878 705.8991 742.1774 807.0458 841.2247 871.3069 909.9726 929.7519 988.8691 1000.3738 1015.7518 1066.0037 1126.4983 1142.5081 1169.0381 1245.6214 1271.3770 1278.2558 1304.1006 1363.9599 1382.9998 1444.3382 1462.5598 1552.6339 1583.5971 1603.8428 1674.8466 3040.9072 3114.1934 3161.4733 3168.9966 3179.2366 3510.7735
redmass: 13.5007 10.2898 7.9185 10.5384 7.1599 6.3258 6.1660 29.6755 7.7387 8.9563 9.6235 5.2474 4.5254 3.1712 5.1889 4.4983 3.7044 6.1042 3.8726 2.8140 5.3174 1.9133 4.1925 4.9319 5.9353 1.4533 3.6682 1.6134 2.4741 1.3683 5.5430 2.6607 2.7056 2.6765 1.2862 1.3178 2.1284 1.3662 1.8600 1.9527 4.0473 5.4599 1.1334 2.3419 8.3903 6.5412 8.8610 9.0160 1.0582 1.1042 1.0886 1.0925 1.0976 1.0641
irintensity: 1.0184 1.5124 0.5666 2.6266 0.8070 2.1229 0.9571 0.1426 1.5239 0.5776 1.6285 4.5318 8.7712 8.4417 11.4293 12.3558 4.8435 26.1451 24.9774 66.9986 11.4368 130.1734 3.3192 8.9320 24.1826 36.6158 17.2938 16.7689 27.9921 2.0613 121.3194 102.1038 56.7383 43.5554 3.7867 82.4017 212.7081 0.3726 111.3566 73.1378 10.7369 20.1263 31.4031 18.4124 90.6378 98.2091 69.1363 269.5827 1.7407 2.2685 0.5134 5.9077 3.6769 30.4005
temp: 298.150 k
press: 1.00000 atm
elementType: 17 17 8 8 8 6 6 6 6 6 6 6 6 6 1 1 1 1 1 1
symmnumber: 1
zpe: 341584.9 jmol-1
zpe.correction: 0.130103 hartree
zpe.thermalcorrener: 0.143287 hartree
zpe.thermalcorrenthalpy: 0.144232 hartree
zpe.thermalcorrgfe: 0.087613 hartree
zpe.sumelectzpe: -1491.345151 hartree
zpe.sumelectthermal: -1491.331967 hartree
zpe.sumelectthermalent: -1491.331022 hartree
zpe.sumelectthermalfe: -1491.387641 hartree
dipole: 0.5522 1.4391 -1.0910
dipole: 1.8884
quadrupole: -102.7220 -90.9084 -96.0120
quadrupole: -14.2182 7.1196 1.2818
quadrupole: -6.1746 5.6391 0.5355 -14.2182 7.1196 1.2818
hfenergy: -1491.4752541 hartree
pointgroup: C01 [X(C9H6Cl2O3)]
dipole: -0.2201165 0.7047863 0.0824409 debye
dipolederiv: -0.1116123 0.1372447 -0.070121 0.2038755 -0.556317 0.2326654 -0.0980261 0.2220376 -0.1295173 -0.7500225 0.018771 -0.2691313 0.0213943 -0.0450562 0.016873 -0.2916891 0.016065 -0.1272853 -0.7539507 0.0938132 -0.2183226 0.1842212 -0.7250011 0.3725294 -0.2726884 0.2170715 -0.5055579 -0.4998618 0.0861222 -0.0741083 0.0380163 -1.0769266 0.1745321 -0.0233518 0.3103028 -0.3511597 -0.6121772 0.2203369 0.159643 0.2189335 -0.5880548 -0.0350498 0.4408716 -0.1229503 -0.6210881 -0.814486 0.0706867 -0.2928101 -0.0595849 -0.0433327 0.0181654 -0.2968173 0.0415225 -0.1199116 1.753513 0.0886203 0.4543425 0.2782284 0.9070501 -0.4667326 0.5465319 -0.2750015 0.4240576 -0.3808595 -0.2478508 0.115557 -0.4533613 -0.2922777 0.1961793 0.2401135 0.1787322 -0.2558516 0.0738317 0.132781 0.0197144 -0.1342681 -0.2053556 -0.0113895 0.1150036 0.0833112 -0.0516694 0.1172271 -0.1010511 0.1162627 0.1749739 0.0071428 0.0204978 0.0165023 -0.0712834 -0.0654915 -0.2606213 -0.356724 0.0339129 -0.3938944 0.8228384 -0.3949505 0.0485238 -0.4160448 0.0913632 -0.27587 0.1064262 -0.0947657 0.1976568 -0.0333028 0.0547176 -0.1365609 0.0229918 -0.1443694 1.097229 0.0802051 0.3951582 -0.0162447 -0.0378528 -0.0057052 0.4456918 0.0324658 0.1205312 0.7037798 -0.3918826 -0.3040873 -0.3679042 1.2546601 -0.1885385 -0.7920173 -0.3274251 1.001028 0.0634734 0.0568591 0.0556974 0.0587894 0.0072066 -0.0514726 0.0443455 -0.0134166 0.0952991 0.0167209 0.0052591 -0.0392257 0.0547444 0.1030374 0.0332725 -0.0179344 0.0164022 0.0664274 0.1528673 -0.04012 -0.0265706 -0.0283989 0.0711431 0.0105252 -0.0408636 0.012475 0.134338 0.1197617 0.0457025 -0.0349402 -0.0035523 0.0500981 0.0320391 -0.0101023 0.0536163 0.1344756 0.0338487 -0.0636903 -0.0262733 -0.059609 0.0299829 0.0190091 -0.0292286 0.0177262 0.1468006 0.3272088 0.0584908 0.1000679 0.0859843 0.3503176 -0.0271672 0.1116959 0.0014019 0.1575809 unknown
polarizability: 166.9358116|-5.1392913|128.6019219|31.1429263|-27.9320486|85.9598003 unknown
InChI: InChI=1S/C9H6Cl2O3/c10-6-2-1-5(3-7(6)11)8(12)4-9(13)14/h1-3,13H,4H2
charge 0 multiplicity 1
20 atoms
Cl -2.192119 2.400384 -1.397152
Cl -4.231781 -0.173893 -1.365384
O  1.718521 -1.807604 1.563785
O  2.529984 2.027694 -0.844543
O  3.607718 -0.013288 -1.137885
C  0.033679 -0.537258 0.406582
C  1.394028 -0.721864 1.011654
C  2.405493 0.447912 0.977331
C  -0.391786 0.695339 -0.154746
C  -0.858395 -1.644443 0.415288
C  -1.686786 0.810785 -0.693732
C  -2.148843 -1.52556 -0.126244
C  -2.566681 -0.294346 -0.681537
C  2.923507 0.7438 -0.423474
H  1.962389 1.362532 1.404061
H  3.261709 0.132979 1.595675
H  0.269631 1.565696 -0.187837
H  -0.516523 -2.587633 0.851729
H  -2.839816 -2.373183 -0.125068
H  2.877372 2.200851 -1.761903
