program: Gaussian 09
title: 000003895
version: EM64L-G09RevD.01
frameworkgroup: C1[X(C21H19NO5)]
method: RPBEPBE
basis: SDD
operation: Freq
keyword: #p
keyword: freq=noraman
keyword: PBEPBE/SDD
title: #p freq=noraman PBEPBE/SDD
converged: YES YES NO NO
title: Mulliken charges:
elementType: O O O O O N C C C C C C C C C C C C C C C C C C C C C H H H H H H H H H H H H H H H H H H H
charge: -0.446048 -0.434489 -0.389880 -0.462799 -0.229869 -0.172230 -0.553829 -0.560231 0.509879 0.397772 0.396636 -0.422723 -0.314786 0.154641 0.155535 -0.391207 -0.402907 0.137512 -0.446396 0.144535 -0.398581 -0.397252 -0.264861 -0.263677 -0.213761 -0.213217 0.085679 0.230960 0.238605 0.243785 0.239154 0.288341 0.252073 0.251159 0.245014 0.210823 0.217396 0.218176 0.231284 0.230504 0.229179 0.228477 0.359303 0.360081 0.348170 0.374069
chargesum: 0.00000
title: Mulliken charges with hydrogens summed into heavy atoms:
elementType: O O O O O N C C C C C C C C C C C C C C C C C C C C C
charge: -0.086745 -0.074408 -0.041710 -0.088730 -0.229869 -0.172230 -0.084265 -0.077292 0.509879 0.397772 0.396636 -0.134382 -0.062713 0.154641 0.155535 -0.140049 -0.157893 0.137512 -0.235572 0.144535 -0.181184 -0.179077 -0.033577 -0.033173 0.015418 0.015260 0.085679
polarizability: 3.64597956e+02 -1.98371722e+01 2.72281439e+02 -1.74800166e+01 -2.48392806e+00 1.52935017e+02
1716.lowfreq: -4.9239 -0.0010 -0.0008 -0.0007 1.3779 3.1575 19.1125 19.8066 28.4240
frequency: 18.8978 19.4865 28.4071 35.5536 42.6390 48.4124 56.0058 90.1669 106.8698 134.5669 154.1111 166.5471 171.6661 193.2187 211.1985 245.7790 269.9924 274.0987 296.5985 341.9569 348.2289 354.7395 356.4529 361.0306 363.1921 385.2067 410.1264 418.3778 436.1106 443.7888 450.4730 485.2518 489.7492 525.6617 526.6023 532.3921 542.5034 557.4387 575.4968 590.5599 609.7680 613.3136 620.5628 684.4823 689.5244 718.0227 723.6126 749.6762 751.9024 754.2305 755.3716 757.7934 762.7341 794.0443 833.5906 834.8314 852.7146 853.3310 859.0235 886.4540 918.1996 924.0786 927.4012 941.2222 949.3432 973.1540 974.4371 979.0824 1021.2881 1040.8969 1046.9912 1074.0581 1079.9500 1095.5964 1142.1202 1150.8818 1152.1858 1157.3875 1171.2574 1171.7720 1183.6530 1196.9927 1202.3126 1223.5542 1238.9540 1245.1186 1252.0021 1255.3468 1294.0243 1303.2877 1304.5235 1316.6854 1355.4209 1360.5088 1375.1560 1390.6406 1394.9785 1412.1988 1422.4662 1437.5862 1440.8790 1471.1908 1473.4268 1494.5127 1496.6323 1510.1966 1587.8012 1602.7885 1603.2408 1610.9927 1612.6191 1620.4238 1653.0604 2957.5906 2961.9465 3077.1653 3082.5592 3104.9254 3110.9695 3112.1109 3120.2894 3125.1187 3141.7941 3142.7451 3164.8877 3165.3728 3188.5570 3215.7420 3529.2354 3550.5323 3580.8739 3580.9794
redmass: 5.8837 5.4392 10.2389 6.5024 6.3967 5.4258 5.4352 5.7663 5.8393 5.9867 5.1452 4.8790 5.2703 5.5535 6.1904 6.1380 4.6669 5.9597 2.8471 1.5836 1.9108 1.1641 3.2900 2.8146 1.4188 8.7154 3.8714 3.1593 2.7504 2.8630 3.4038 4.7997 4.5153 3.8287 4.0432 3.5273 2.7451 6.4417 3.1552 1.5929 4.9394 4.9901 4.6757 4.4753 4.1052 4.1658 3.5727 3.8408 3.9274 2.5120 1.7811 1.4286 5.6544 1.6154 2.2619 2.2502 2.1882 2.3236 4.9614 1.6685 1.3503 1.7160 1.8711 1.5857 1.7388 1.3325 2.8683 1.5175 2.4964 2.2145 2.1191 2.1955 2.1354 2.1311 3.2330 1.2628 1.4000 1.3673 1.0561 1.0628 1.2409 2.7588 2.7785 1.5682 1.8267 2.4425 1.8128 2.5248 2.0087 1.6102 1.3849 1.3245 1.3327 1.4886 2.4387 6.8359 5.2607 3.0277 4.4356 2.3106 2.2896 1.1690 1.2351 2.2816 2.0479 2.8372 6.0222 6.2898 6.2890 6.6483 6.6245 6.6258 8.1544 1.0709 1.0711 1.0889 1.0895 1.0900 1.0886 1.0882 1.0888 1.0882 1.0918 1.0921 1.1003 1.1003 1.0921 1.0900 1.0640 1.0657 1.0661 1.0661
irintensity: 0.2039 0.2722 0.9108 0.3018 0.6202 0.8061 0.3604 0.6494 1.5275 0.3157 1.8544 3.1638 0.8582 1.3569 0.0168 7.3822 0.3680 6.1172 25.8098 44.3306 30.9409 103.8628 21.4202 21.5505 107.8196 8.0175 5.3336 12.8458 4.5823 6.3931 2.1908 9.6873 6.6155 27.5334 9.5572 7.4618 6.6874 1.7017 20.3773 136.4908 8.8411 6.9075 23.5803 14.7774 8.0601 2.7227 6.1534 7.0859 12.7785 60.4184 122.1123 3.6820 49.8942 56.2963 1.1148 2.3184 24.7475 6.3811 47.3607 13.9850 1.1263 15.1865 50.6342 9.0919 37.0738 7.3653 174.5180 40.9490 14.3020 6.0514 0.5114 36.2381 164.0601 179.4899 3.4932 18.0927 58.0214 176.1947 3.9032 0.8320 4.2636 4.0097 35.9677 110.9894 13.3965 31.6262 9.4860 51.0343 102.6683 37.4829 9.7676 48.9024 31.5696 42.0626 24.9267 23.1809 13.2101 78.8026 38.9068 4.9290 58.4975 2.2793 26.5014 83.1483 10.7712 314.5919 35.0369 7.5872 44.8987 4.6755 8.2301 277.0811 217.4364 59.8156 39.2451 6.8118 5.3142 28.5788 14.6819 14.0377 10.6141 1.0913 31.9702 6.7972 14.0968 40.2146 3.9055 5.4033 30.1247 34.3730 22.2548 47.4755
temp: 298.150 k
press: 1.00000 atm
elementType: 8 8 8 8 8 7 6 6 6 6 6 6 6 6 6 6 6 6 6 6 6 6 6 6 6 6 6 1 1 1 1 1 1 1 1 1 1 1 1 1 1 1 1 1 1 1
symmnumber: 1
zpe: 928974.5 jmol-1
zpe.correction: 0.353828 hartree
zpe.thermalcorrener: 0.378189 hartree
zpe.thermalcorrenthalpy: 0.379133 hartree
zpe.thermalcorrgfe: 0.297471 hartree
zpe.sumelectzpe: -1240.566730 hartree
zpe.sumelectthermal: -1240.542369 hartree
zpe.sumelectthermalent: -1240.541425 hartree
zpe.sumelectthermalfe: -1240.623087 hartree
dipole: -5.7590 -0.8423 -1.1934
dipole: 5.9413
quadrupole: -175.0908 -117.5818 -152.4769
quadrupole: 1.3360 -10.3981 -4.5266
quadrupole: -26.7077 30.8014 -4.0937 1.3360 -10.3981 -4.5266
hfenergy: -1240.920558 hartree
pointgroup: C01 [X(C21H19N1O5)]
dipole: -0.0318016 -2.2842187 0.4951954 debye
polarizability: 261.933669|-17.3220758|361.7090814|-37.6443164|26.2527523|166.1716609 unknown
InChI: InChI=1S/C21H19NO5/c23-18-7-3-1-5-14(18)12-22(13-15-6-2-4-8-19(15)24)16-9-10-20(25)17(11-16)21(26)27/h1-11,23-26H,12-13H2
charge 0 multiplicity 1
46 atoms
O  -3.038032 -1.088804 1.107107
O  2.728457 1.021329 -0.184559
O  -1.721899 5.192645 1.397695
O  0.902216 4.2229 -1.886185
O  -0.184021 5.941202 -0.779838
N  -0.092689 -0.151945 0.227742
C  -0.173355 -1.240597 1.224107
C  0.491072 -0.535266 -1.072798
C  -0.493027 1.172979 0.51782
C  -1.054695 -2.426922 0.824028
C  1.922479 -1.07948 -1.028469
C  -0.04955 2.280866 -0.254458
C  -1.374094 1.467042 1.60528
C  -2.470546 -2.326673 0.752245
C  3.020184 -0.291827 -0.585106
C  -0.475887 -3.682984 0.523848
C  2.20118 -2.393681 -1.472284
C  -0.455456 3.617814 0.00793
C  -1.758533 2.786121 1.895692
C  -1.320526 3.87844 1.111133
C  -3.270907 -3.427799 0.36901
C  4.337886 -0.806526 -0.568838
C  -1.259107 -4.798933 0.147893
C  3.512832 -2.922677 -1.473977
C  -2.662403 -4.665262 0.062821
C  4.583204 -2.124349 -1.01364
C  0.049552 4.711854 -0.856352
H  -0.517326 -0.817568 2.180181
H  0.849669 -1.633327 1.400304
H  0.440202 0.332555 -1.748758
H  -0.144021 -1.324672 -1.525794
H  0.66807 2.14603 -1.062151
H  -1.808184 0.66002 2.197651
H  0.614388 -3.782331 0.591237
H  1.366171 -3.008793 -1.830295
H  -2.437389 2.966839 2.740582
H  -4.363345 -3.324853 0.321407
H  5.169201 -0.178637 -0.221384
H  -0.780156 -5.757689 -0.075702
H  3.695659 -3.942032 -1.829132
H  -3.285197 -5.516924 -0.231681
H  5.6054 -2.51808 -1.002982
H  -4.015883 -1.089347 0.958111
H  3.545112 1.509415 0.086281
H  -2.320634 5.190616 2.18752
H  1.18793 5.010513 -2.422044
