program: Gaussian 09
title: 000277672
version: EM64L-G09RevD.01
frameworkgroup: C1[X(C9H7FO3)]
method: RPBEPBE
basis: SDD
operation: Freq
keyword: #pfreq=noraman
keyword: PBEPBE/SDD
title: #p freq=noraman PBEPBE/SDD
converged: YES YES NO NO
title: Mulliken charges:
elementType: F O O O C C C C C C C C C H H H H H H H
charge: -0.192591 -0.197246 -0.390403 -0.237438 0.301316 0.131263 -0.600707 -0.297743 -0.318014 -0.391115 -0.368851 0.336820 0.213691 0.253457 0.279128 0.281931 0.283932 0.264395 0.264280 0.383897
chargesum: 0.00000
title: Mulliken charges with hydrogens summed into heavy atoms:
elementType: F O O O C C C C C C C C C
charge: -0.192591 -0.197246 -0.006506 -0.237438 0.301316 0.131263 -0.068121 -0.015813 -0.034082 -0.126720 -0.104572 0.336820 0.213691
polarizability: 1.45559240e+02 -9.28751354e+00 1.12650384e+02 -4.12769476e+00 -7.56824678e+00 5.89981929e+01
1716.lowfreq: -10.7830 -0.0003 -0.0002 0.0006 4.1967 11.5551 24.4810 52.7507 75.1106
frequency: 24.2959 52.7426 75.0957 100.7432 139.1681 182.5046 284.2335 308.8304 370.4455 408.1158 411.7364 454.6446 477.1745 497.0022 552.3495 588.3510 623.4961 640.3369 652.6192 722.2694 761.1126 807.0531 825.1137 844.8797 879.0612 933.7601 962.0927 987.7814 996.4160 1007.7377 1069.4984 1112.1084 1159.6191 1169.7471 1210.1823 1252.2908 1268.4687 1302.5777 1329.2059 1379.7641 1413.3289 1449.0313 1492.8478 1573.7384 1599.8786 1611.4817 1648.3297 3047.3288 3128.5965 3157.8062 3159.3897 3179.3611 3182.1373 3510.0202
redmass: 8.7834 5.6931 6.1217 10.8068 7.2841 6.2781 7.3754 9.4153 7.6488 2.9694 2.9825 3.5671 4.8026 3.1504 3.8562 2.5533 6.9216 4.1721 1.7819 4.1816 5.0108 5.2598 1.2922 1.8185 3.8899 2.4005 1.3928 1.3643 3.7999 2.3994 2.1740 1.3054 1.5292 1.3581 2.0605 2.4390 1.6036 1.2945 2.1329 6.1008 4.0328 1.0985 2.4773 9.0951 7.0096 7.3128 8.3318 1.0587 1.1041 1.0901 1.0890 1.0963 1.0975 1.0641
irintensity: 1.6739 0.4568 1.6888 4.1819 0.1945 5.5117 0.3878 0.9689 2.9648 7.1396 1.1245 4.7947 1.6631 17.5125 67.9569 109.4897 0.2721 7.4457 92.5209 1.4274 6.6126 29.1794 4.2918 57.0073 36.6067 60.4947 5.7747 4.2217 20.3245 25.6607 231.6515 19.5554 110.9173 78.7429 18.0983 238.0636 58.0707 3.3978 42.7741 7.1983 16.2702 26.9664 40.2698 190.4483 152.8989 82.0541 144.3564 2.3193 1.3274 1.3663 0.1704 0.6367 7.4343 36.4675
temp: 298.150 k
press: 1.00000 atm
elementType: 9 8 8 8 6 6 6 6 6 6 6 6 6 1 1 1 1 1 1 1
symmnumber: 1
zpe: 370710.2 jmol-1
zpe.correction: 0.141196 hartree
zpe.thermalcorrener: 0.152668 hartree
zpe.thermalcorrenthalpy: 0.153612 hartree
zpe.thermalcorrgfe: 0.101836 hartree
zpe.sumelectzpe: -671.743393 hartree
zpe.sumelectthermal: -671.731921 hartree
zpe.sumelectthermalent: -671.730977 hartree
zpe.sumelectthermalfe: -671.782753 hartree
dipole: -0.6333 -0.9861 0.4426
dipole: 1.2528
quadrupole: -73.5769 -81.0529 -69.7425
quadrupole: 8.2906 1.0050 -0.0272
quadrupole: 1.2139 -6.2621 5.0483 8.2906 1.0050 -0.0272
hfenergy: -671.8845885 hartree
pointgroup: C01 [X(C9H7F1O3)]
dipole: -0.1991667 0.4507979 -0.0072015 debye
dipolederiv: -1.1480229 -0.1236237 -0.3160737 -0.1434937 -0.2260325 -0.0563279 -0.346861 -0.0539973 -0.2597481 -0.7383494 -0.1080243 -0.1584362 -0.2175655 -0.858219 -0.2842953 -0.2093336 -0.1247411 -0.3852454 -1.1024 -0.2319406 0.2003139 -0.3527861 -0.4399534 0.1952158 0.3812686 0.1704266 -0.3937599 -0.6246233 -0.1107375 0.0865354 -0.1883469 -0.7783949 -0.1537859 0.1199601 -0.3759581 -0.5707362 -0.8410462 -0.0570358 -0.2316165 0.0243658 -0.1920138 -0.031991 -0.2738097 -0.0381585 -0.1080563 1.7357326 -0.1103664 0.3538074 -0.1597549 1.0874595 0.3077209 0.5462582 0.0955726 0.2463361 -0.454942 0.3500501 0.1407911 0.4789571 -0.3691844 -0.1871984 0.2066597 -0.1884576 -0.1674321 0.2305692 -0.0162474 0.0964037 0.1725662 0.0375945 0.0698142 0.1134648 0.04965 -0.054799 0.2062015 0.0808724 0.1026786 -0.1601672 0.0705538 -0.0071222 0.0729989 0.0515322 -0.0510718 -0.4398494 0.0513339 -0.0638791 0.2679265 -0.0152555 0.099136 -0.0334369 0.0504628 -0.1588263 -0.2515637 -0.1394263 -0.0425231 -0.3144124 -0.1294612 -0.0865494 -0.0840436 -0.0383919 -0.1924324 1.2901897 0.116077 0.3707183 0.1176099 0.4022219 0.0847423 0.3952534 0.0857536 0.2550973 1.2708778 0.3807893 -0.4310221 0.5086105 0.9148956 0.2354122 -0.8038808 0.5366011 0.896868 0.0674106 -0.069481 0.0566013 -0.054309 0.0181332 0.0597008 0.0519449 0.0095359 0.0762108 0.0234973 -0.0142102 -0.0577073 -0.0443931 0.0892039 -0.0369649 -0.0314418 -0.0192643 0.068117 0.1378472 0.0532516 -0.0298216 0.0410384 0.0560658 0.0075053 -0.04661 -0.0044694 0.1323422 0.130607 -0.0569428 -0.0254509 -0.0010766 0.026798 -0.0226075 -0.0107616 -0.0400233 0.1405395 0.0797327 -0.0293605 -0.0344368 -0.0479277 0.0018112 -0.0455144 -0.0421286 -0.0436456 0.1602016 0.0284159 0.0694599 -0.0343292 0.072889 0.0358498 -0.0024187 -0.0350661 -0.004489 0.1703208 0.3997154 -0.0344378 0.0174467 0.0002696 0.2679275 -0.1444718 0.0295651 -0.1179387 0.1960742 unknown
polarizability: 144.0849786|0.7740981|107.4681845|17.0936953|15.3870685|65.6546536 unknown
InChI: InChI=1S/C9H7FO3/c10-7-3-1-6(2-4-7)8(11)5-9(12)13/h1-4,12H,5H2
charge 0 multiplicity 1
20 atoms
F  4.213253 0.321309 1.069066
O  -1.447571 -1.764557 -1.108753
O  -3.73385 0.430899 0.700052
O  -2.178967 2.145137 0.884975
C  0.293374 -0.302513 -0.30661
C  -1.082681 -0.592323 -0.817676
C  -2.078443 0.581574 -1.037018
C  0.722485 1.002695 0.064102
C  1.202786 -1.394122 -0.199714
C  2.036255 1.216324 0.528566
C  2.516459 -1.196401 0.258512
C  2.90237 0.111841 0.611533
C  -2.627215 1.157303 0.258632
H  -1.584191 1.398702 -1.587751
H  -2.910931 0.174367 -1.629761
H  0.033757 1.85175 0.021414
H  0.851977 -2.390515 -0.486173
H  2.385867 2.209062 0.824915
H  3.230492 -2.020232 0.344152
H  -4.059827 0.808698 1.562238
