program: Gaussian 09
title: 000277668
version: EM64L-G09RevD.01
frameworkgroup: C1[X(C13H9Br2N5O2)]
method: RPBEPBE
basis: SDD
operation: Freq
keyword: #p
keyword: freq=noraman
keyword: PBEPBE/SDD
title: #p freq=noraman PBEPBE/SDD
converged: YES YES NO NO
title: Mulliken charges:
elementType: Br Br O O N N N N N C C C C C C C C C C C C C H H H H H H H H H
charge: 0.039218 0.035937 -0.157854 -0.283308 -0.391801 0.048958 -0.087226 -0.076875 0.051646 0.458945 -0.392343 -0.333501 -0.136798 -0.132403 -0.244580 0.146592 -0.260222 -0.326415 -0.149397 -0.156244 -0.224026 0.085550 0.249417 0.298063 0.256656 0.256592 0.353523 0.298348 0.261020 0.255585 0.256942
chargesum: 0.00000
title: Mulliken charges with hydrogens summed into heavy atoms:
elementType: Br Br O O N N N N N C C C C C C C C C C C C C
charge: 0.039218 0.035937 -0.157854 -0.283308 -0.038278 0.048958 -0.087226 -0.076875 0.051646 0.458945 -0.142926 -0.035439 0.119858 0.124189 -0.244580 0.146592 0.038127 -0.065395 0.106188 0.100698 -0.224026 0.085550
polarizability: 6.76302980e+02 4.65561993e+00 2.84780981e+02 -1.12817553e-01 -3.72350023e-02 7.50487256e+01
1716.lowfreq: -13.9349 -4.3899 -3.1060 -0.0005 0.0004 0.0006 1.5952 17.3881 29.9728
frequency: -13.9116 17.3661 29.9697 35.9759 50.4991 68.7852 70.6315 112.4378 127.2418 149.7992 162.5106 169.0170 190.1315 229.3637 275.9074 280.4206 301.0982 340.8727 346.2314 361.0581 397.5443 408.2556 412.8193 442.6308 458.4134 480.0535 515.7499 534.3366 584.5693 608.3046 619.3946 623.2626 673.6910 692.2964 711.2687 722.7729 724.4775 799.2035 817.7487 832.9032 837.1496 845.2484 853.6845 897.2861 912.9694 957.1335 972.3903 985.8745 988.8108 990.0418 994.9444 1048.6502 1051.9691 1057.2948 1099.7917 1104.7986 1114.9608 1159.1475 1174.5995 1188.6564 1230.9924 1281.7339 1288.1888 1296.0753 1339.0751 1347.6531 1369.3760 1373.3525 1403.8996 1408.7575 1449.1101 1456.7613 1475.5583 1496.1413 1560.8304 1581.8440 1584.5605 1593.9601 3140.6264 3157.8627 3159.0824 3165.3917 3166.3696 3176.2948 3177.9080 3179.9855 3185.5694
redmass: 4.7628 18.9111 5.8408 9.1758 5.7384 10.3405 11.3219 10.1551 11.5865 9.9870 16.1666 8.4147 11.6848 8.0480 8.0840 6.0363 7.6248 6.7051 9.4286 5.1963 11.0119 2.9473 3.0601 6.4929 5.8759 8.8238 2.9043 3.7486 9.0389 8.1303 7.3868 7.3091 8.1863 10.2831 3.6593 3.8404 8.9306 8.8221 1.3190 1.2612 4.5191 1.4378 1.5090 9.2748 1.1970 1.3537 1.3653 1.3390 4.2664 4.4314 1.3469 4.7030 3.4329 2.6679 2.9857 1.7333 1.4470 1.4545 1.3992 1.9613 3.5974 1.6075 1.6429 1.4234 8.9199 8.3233 5.9845 6.6882 4.2111 3.7424 2.9390 2.4879 3.2304 2.5607 7.3970 6.8984 6.5848 6.1013 1.0905 1.0886 1.0883 1.0803 1.0872 1.0969 1.0956 1.0978 1.0974
irintensity: 0.0760 0.0425 0.5495 0.8268 0.0071 0.1626 1.3463 0.0929 1.2674 0.0470 0.0397 0.9819 0.6215 4.1746 1.4607 2.5694 34.6598 0.1030 5.1941 0.7411 18.8589 0.0320 0.0296 6.2447 52.5624 8.3621 7.1410 20.6113 0.6952 15.2088 3.2456 2.1862 19.3425 1.3608 0.4712 3.0279 31.4664 71.2280 11.0999 4.2871 29.1299 50.1960 66.7469 4.2771 99.8719 7.9998 1.6331 1.1149 108.9360 48.4823 1.3658 188.5377 50.0776 106.0499 129.9402 123.4527 2.4696 42.0078 7.7782 0.0081 21.4113 19.4486 18.7129 5.7738 32.9499 78.0867 22.7238 38.1816 24.8079 18.3471 590.3389 74.6467 9.3196 341.7905 37.9714 2.6657 134.1348 61.6690 3.5484 1.9495 0.3411 87.7699 38.6471 5.7658 4.6341 7.0753 3.0793
temp: 298.150 k
press: 1.00000 atm
elementType: 35 35 8 8 7 7 7 7 7 6 6 6 6 6 6 6 6 6 6 6 6 6 1 1 1 1 1 1 1 1 1
symmnumber: 1
zpe: 536294.1 jmol-1
zpe.correction: 0.204264 hartree
zpe.thermalcorrener: 0.223315 hartree
zpe.thermalcorrenthalpy: 0.224260 hartree
zpe.thermalcorrgfe: 0.152292 hartree
zpe.sumelectzpe: -950.200833 hartree
zpe.sumelectthermal: -950.181781 hartree
zpe.sumelectthermalent: -950.180837 hartree
zpe.sumelectthermalfe: -950.252805 hartree
dipole: -2.4767 -2.4045 0.0038
dipole: 3.4519
quadrupole: -137.7932 -155.3672 -148.4185
quadrupole: -9.6685 -0.0031 0.0371
quadrupole: 9.3997 -8.1742 -1.2255 -9.6685 -0.0031 0.0371
hfenergy: -950.4050965 hartree
pointgroup: C01 [X(C13H9Br2N5O2)]
dipole: -0.9058736 -0.908801 -0.4448558 debye
polarizability: 672.20965|16.5048854|252.6218167|40.8954941|78.1036302|111.3012199 unknown
InChI: InChI=1S/C13H9Br2N5O2/c14-9-1-5-11(6-2-9)16-18-13(20(21)22)19-17-12-7-3-10(15)4-8-12/h1-8,16H
charge 0 multiplicity 1
31 atoms
Br -6.741546 -2.778578 -1.585612
Br 7.602479 -1.689224 -0.30179
O  0.835965 3.532054 1.583246
O  -1.415969 3.236573 1.330629
N  -2.273801 1.028977 0.324616
N  -0.98667 0.688216 0.249685
N  1.638762 -0.078682 0.070078
N  1.371371 1.108678 0.567523
N  -0.161728 2.823323 1.221544
C  -3.274157 0.134861 -0.121811
C  -4.628204 0.544857 -0.018185
C  -2.942966 -1.135855 -0.658862
C  -5.656638 -0.315631 -0.450883
C  -3.970743 -1.994095 -1.090674
C  -5.31819 -1.578587 -0.983532
C  3.036747 -0.363955 0.024462
C  4.068251 0.517639 0.463647
C  3.373239 -1.637277 -0.508604
C  5.413479 0.124727 0.367472
C  4.720497 -2.037855 -0.60844
C  5.725709 -1.149325 -0.168404
C  0.023538 1.464916 0.644235
H  -4.88062 1.527372 0.396718
H  -1.892462 -1.42939 -0.728982
H  -6.702086 -0.005508 -0.373614
H  -3.726746 -2.975602 -1.506273
H  -2.49568 1.970446 0.721442
H  3.790157 1.494261 0.871449
H  2.563118 -2.295246 -0.83831
H  6.21314 0.792086 0.701215
H  4.982856 -3.016678 -1.018488
